{"text_format":"1","workbook":"xlsx","n_sheets":5,"sheets":["TAB 1-Installation Report","TAB 2-Measure Specifications","Measure Category","Master Export","Export"],"not_rendered":{"charts":0,"images":0,"macros":1,"external_links":1,"defined_names":9,"comments":0,"pivot_tables":0},"unopened":[],"bounds":{"document_bytes":16777216,"sheet_cells":100000,"rows_first":2000,"rows_last":500,"rows_between":2000,"halvings":0,"cell_chars":16384,"cell_head_chars":4096},"cells_cut":0,"cells_raw":0,"read":"whole","date_system":"1900"}

{"sheet":"TAB 1-Installation Report","index":0,"n_rows":42,"n_cols":18,"rows_kept":42,"cut":false,"hidden":false,"merged":[[0,1,0,13],[1,1,1,13],[2,1,2,13],[10,4,10,10],[11,1,11,2],[38,1,38,2],[7,7,7,8],[4,1,4,16],[39,1,39,2],[40,1,40,2],[10,1,10,2],[9,1,9,11],[6,3,6,4],[7,3,7,4],[6,7,6,8]]}
[null,"New Jersey Office of Clean Energy"]
[null,"Pay for Performance Program"]
[null,"Installation Report v4.0b (09-20-2016)"]
[]
[null,"INSTRUCTIONS:\n1) This document should only be used for projects using ERP Tables v4.4 or earlier. Projects using ERP Table v4.5 and later must use same ERP Tables, updated with as-built data to complete this exercise. \n2) Open approved ERP Excel Tables. Copy and paste values from  'Table 14 Measure Costs & Savings' (v3.2a and older) or 'Measure Simulation' tab (v4.0-4.4) into Columns C through L in the table below. Align with table headers.\n3) Any changes to the installed scope of work must follow Program Guidelines v4.1, Section 5.4. \n4) Enter Actual Installed Cost for each measure in Column N. This is the actual amount paid for both material and labor for each measure and should match invoice(s). \n5) Include invoices with submittal. Invoices should be organized by measure, include a description of the equipment installed, quantity, and unit price (e.g. material price per fixture, motor, etc.), and align with measure costs in Column N.  Material and labor should be indicated separately if possible. Invoices must also be submitted for any CM and Partner fees listed. \n6) Fill out all remaining columns (all blue cells) for each measure.\n7) Hide extra rows as necessary. \n8) Go to TAB-2"]
[]
[null,null,"P4P Project Name:",null,null,"P4P Application #: "]
[null,null,"P4P Partner Firm:",null,null,"Report Date: "]
[]
[null,"<-------------------------------------------------------Paste from approved ERP Excel Tables---------------------------------------------------------------->"]
{"$rows_left_out":33}
{"sheet":"TAB 2-Measure Specifications","index":1,"n_rows":35,"n_cols":25,"rows_kept":35,"cut":false,"hidden":false,"merged":[[9,23,9,24],[9,1,9,2],[0,0,0,12],[1,0,1,12],[2,0,2,12],[4,1,4,11]]}
["New Jersey Office of Clean Energy"]
["Pay for Performance Program"]
["As-Built Measure Specifications"]
[]
[null,"INSTRUCTIONS:\n1) Fill out table below so that it reflects actual installed measures. Please be specific as this table will be used to conduct the Post-Inspection. Use Additional Notes column to explain any deviations from approved scope of work in the ERP. \n2) For lighting measures, please include a separate Lighting Worksheet (using ERP Excel Tables, Lighting table) showing as-built lighting schedule. Changes to as-built fixtures and/or controls from proposed fixtures and/or controls in the ERP should be highlighted/noted. \n3) Upon completion of both TAB 1-Installation Report and TAB 2-Measure Specifications, please submit to Program Manager, along with Invoices, Request for Incentive #2 form, and any supplementary documentation (e.g. revised ERP (if required), etc.)."]
[]
[null,null,"P4P Project Name:",{"$f":"IF('TAB 1-Installation Report'!D7=0, \" \",'TAB 1-Installation Report'!D7)","v":" "},"P4P Application #: ",{"$f":"IF('TAB 1-Installation Report'!H7=0, \" \",'TAB 1-Installation Report'!H7)","v":" "}]
[null,null,"P4P Partner Firm:",{"$f":"IF('TAB 1-Installation Report'!D8=0, \" \",'TAB 1-Installation Report'!D8)","v":" "},"Report Date: ",{"$f":"IF('TAB 1-Installation Report'!H8=0, \" \",'TAB 1-Installation Report'!H8)","v":" "}]
[]
[null,"Measure Name",null,"Measure Category","Measure Details ","Location ","Manufacturer","Model","Capacity","Capacity Units","Quantity","Efficiency","Efficiency Units","Additional Notes"]
{"$rows_left_out":26}
{"sheet":"Measure Category","index":2,"n_rows":98,"n_cols":2,"rows_kept":98,"cut":false,"hidden":true,"merged":[]}
["Measure Category (consistent with database) - \nMeasure Descriptions tab","Measure Life"]
["                    --  HVAC --"]
["Air Cooled Chiller (Electric)",25]
["Air to Air Heat Pump",15]
["Central DX AC System",15]
["Closed Loop HP",15]
["Desiccant System (Gas or Electric)",15]
["Dual Enthalpy Economizer",15]
["Gas Absorption Chiller",25]
["Gas Furnace",20]
{"$rows_left_out":89}
{"sheet":"Master Export","index":3,"n_rows":28,"n_cols":50,"rows_kept":28,"cut":false,"hidden":true,"merged":[]}
["Pay For Performance - Existing Buildings: 2016"]
["Project Name",{"$f":"'TAB 1-Installation Report'!D7","v":0},"Project ID",0,"Street Address",0,"Project SF",0,"CM Fees",{"$f":"'TAB 1-Installation Report'!M39","v":0},"Partner Fees",{"$f":"'TAB 1-Installation Report'!M40","v":0},"Total Measure Cost",{"$f":"'TAB 1-Installation Report'!M41","v":0},"Committed Incentive #1",0,"Paid Incentive #1",0,"Committed Incentive #2",0,"Paid Incentive #2",0,"Committed Incentive #3",0,"Paid Incentive #3",0,"Annual Energy Cost",0,"Annual Cost Savings",0,"Internal Rate of Return (IRR)",0,"Life Cycle Savings",0,"Simple Payback (yrs)",0,"Simple Payback with NJCEP Incentive (yrs)",0,"Peak kW",0,"Total % Savings",0,"% Elec",0,"% Gas",0,"% Oil or Propane",0,"% Other",0]
["Measure Name","Measure Description","Manufacturer","Model","Installation Cost per Unit","Annual Energy Cost Savings per Unit","Incentive Per Unit","Simple Payback w/o Incentives","Simple Payback w/ Incentives","Peak Demand Reduction per Unit","Annual Electricity Savings per Unit","Lifetime Electricity Savings per Unit","Annual Gas Savings per Unit","Lifetime Gas Savings per Unit","Annual Propane Savings per Unit","Lifetime Propane Savings per Unit","Annual Oil Savings per Unit","Lifetime Oil Savings per Unit","Other Energy Savings MMBTU per Unit","Other Lifetime Energy Savings MMBTU per Unit","CO2e Emissions Reduction per Unit (lbs)","Quantity Committed","Quantity Installed"]
[{"$f":"'TAB 2-Measure Specifications'!D11","v":0},{"$f":"'TAB 1-Installation Report'!C13","v":0},{"$f":"'TAB 2-Measure Specifications'!G11","v":0},{"$f":"'TAB 2-Measure Specifications'!H11","v":0},{"$f":"IFERROR('TAB 1-Installation Report'!M13/W4,0)","v":0},0,0,0,0,{"$f":"IFERROR('TAB 1-Installation Report'!L13/W4,0)","v":0},{"$f":"IFERROR('TAB 1-Installation Report'!E13/W4,0)","v":0},{"$f":"IFERROR('TAB 1-Installation Report'!E13*VLOOKUP('TAB 2-Measure Specifications'!D11,MeasureLife,2,FALSE)/W4,0)","v":0},{"$f":"IFERROR('TAB 1-Installation Report'!F13/W4,0)","v":0},{"$f":"IFERROR('TAB 1-Installation Report'!F13*VLOOKUP('TAB 2-Measure Specifications'!D11,MeasureLife,2,FALSE)/W4,0)","v":0},{"$f":"IFERROR('TAB 1-Installation Report'!J3/W4,0)","v":0},{"$f":"IFERROR('TAB 1-Installation Report'!J13*VLOOKUP('TAB 2-Measure Specifications'!D11,MeasureLife,2,FALSE)/W4,0)","v":0},{"$f":"IFERROR('TAB 1-Installation Report'!J13/W4,0)","v":0},{"$f":"IFERROR('TAB 1-Installation Report'!J13*VLOOKUP('TAB 2-Measure Specifications'!D11,MeasureLife,2,FALSE)/W4,0)","v":0},{"$f":"IFERROR(SUM('TAB 1-Installation Report'!G14,'TAB 1-Installation Report'!H14,'TAB 1-Installation Report'!I14,'TAB 1-Installation Report'!K14)/W4,0)","v":0},{"$f":"IFERROR(SUM('TAB 1-Installation Report'!G14,'TAB 1-Installation Report'!H14,'TAB 1-Installation Report'!I14,'TAB 1-Installation Report'!K14)*VLOOKUP('TAB 2-Measure Specifications'!D11,MeasureLife,2,FALSE)/W4,0)","v":0},0,0,{"$f":"IFERROR('TAB 2-Measure Specifications'!K11*1,1)","v":0},"Capacity/Size",{"$f":"'TAB 2-Measure Specifications'!I11","v":0},"Capacity/Size Units",{"$f":"'TAB 2-Measure Specifications'!J11","v":0},"Efficiency",{"$f":"'TAB 2-Measure Specifications'!L11","v":0},"Efficiency Units",{"$f":"'TAB 2-Measure Specifications'!M11","v":0}]
[{"$f":"'TAB 2-Measure Specifications'!D12","v":0},{"$f":"'TAB 1-Installation Report'!C14","v":0},{"$f":"'TAB 2-Measure Specifications'!G12","v":0},{"$f":"'TAB 2-Measure Specifications'!H12","v":0},{"$f":"IFERROR('TAB 1-Installation Report'!M14/W5,0)","v":0},0,0,0,0,{"$f":"IFERROR('TAB 1-Installation Report'!L14/W5,0)","v":0},{"$f":"IFERROR('TAB 1-Installation Report'!E14/W5,0)","v":0},{"$f":"IFERROR('TAB 1-Installation Report'!E14*VLOOKUP('TAB 2-Measure Specifications'!D12,MeasureLife,2,FALSE)/W5,0)","v":0},{"$f":"IFERROR('TAB 1-Installation Report'!F14/W5,0)","v":0},{"$f":"IFERROR('TAB 1-Installation Report'!F14*VLOOKUP('TAB 2-Measure Specifications'!D12,MeasureLife,2,FALSE)/W5,0)","v":0},{"$f":"IFERROR('TAB 1-Installation Report'!J4/W5,0)","v":0},{"$f":"IFERROR('TAB 1-Installation Report'!J14*VLOOKUP('TAB 2-Measure Specifications'!D12,MeasureLife,2,FALSE)/W5,0)","v":0},{"$f":"IFERROR('TAB 1-Installation Report'!J14/W5,0)","v":0},{"$f":"IFERROR('TAB 1-Installation Report'!J14*VLOOKUP('TAB 2-Measure Specifications'!D12,MeasureLife,2,FALSE)/W5,0)","v":0},{"$f":"IFERROR(SUM('TAB 1-Installation Report'!G15,'TAB 1-Installation Report'!H15,'TAB 1-Installation Report'!I15,'TAB 1-Installation Report'!K15)/W5,0)","v":0},{"$f":"IFERROR(SUM('TAB 1-Installation Report'!G15,'TAB 1-Installation Report'!H15,'TAB 1-Installation Report'!I15,'TAB 1-Installation Report'!K15)*VLOOKUP('TAB 2-Measure Specifications'!D12,MeasureLife,2,FALSE)/W5,0)","v":0},0,0,{"$f":"IFERROR('TAB 2-Measure Specifications'!K12*1,1)","v":0},"Capacity/Size",{"$f":"'TAB 2-Measure Specifications'!I12","v":0},"Capacity/Size Units",{"$f":"'TAB 2-Measure Specifications'!J12","v":0},"Efficiency",{"$f":"'TAB 2-Measure Specifications'!L12","v":0},"Efficiency Units",{"$f":"'TAB 2-Measure Specifications'!M12","v":0}]
[{"$f":"'TAB 2-Measure Specifications'!D13","v":0},{"$f":"'TAB 1-Installation Report'!C15","v":0},{"$f":"'TAB 2-Measure Specifications'!G13","v":0},{"$f":"'TAB 2-Measure Specifications'!H13","v":0},{"$f":"IFERROR('TAB 1-Installation Report'!M15/W6,0)","v":0},0,0,0,0,{"$f":"IFERROR('TAB 1-Installation Report'!L15/W6,0)","v":0},{"$f":"IFERROR('TAB 1-Installation Report'!E15/W6,0)","v":0},{"$f":"IFERROR('TAB 1-Installation Report'!E15*VLOOKUP('TAB 2-Measure Specifications'!D13,MeasureLife,2,FALSE)/W6,0)","v":0},{"$f":"IFERROR('TAB 1-Installation Report'!F15/W6,0)","v":0},{"$f":"IFERROR('TAB 1-Installation Report'!F15*VLOOKUP('TAB 2-Measure Specifications'!D13,MeasureLife,2,FALSE)/W6,0)","v":0},{"$f":"IFERROR('TAB 1-Installation Report'!J5/W6,0)","v":0},{"$f":"IFERROR('TAB 1-Installation Report'!J15*VLOOKUP('TAB 2-Measure Specifications'!D13,MeasureLife,2,FALSE)/W6,0)","v":0},{"$f":"IFERROR('TAB 1-Installation Report'!J15/W6,0)","v":0},{"$f":"IFERROR('TAB 1-Installation Report'!J15*VLOOKUP('TAB 2-Measure Specifications'!D13,MeasureLife,2,FALSE)/W6,0)","v":0},{"$f":"IFERROR(SUM('TAB 1-Installation Report'!G16,'TAB 1-Installation Report'!H16,'TAB 1-Installation Report'!I16,'TAB 1-Installation Report'!K16)/W6,0)","v":0},{"$f":"IFERROR(SUM('TAB 1-Installation Report'!G16,'TAB 1-Installation Report'!H16,'TAB 1-Installation Report'!I16,'TAB 1-Installation Report'!K16)*VLOOKUP('TAB 2-Measure Specifications'!D13,MeasureLife,2,FALSE)/W6,0)","v":0},0,0,{"$f":"IFERROR('TAB 2-Measure Specifications'!K13*1,1)","v":0},"Capacity/Size",{"$f":"'TAB 2-Measure Specifications'!I13","v":0},"Capacity/Size Units",{"$f":"'TAB 2-Measure Specifications'!J13","v":0},"Efficiency",{"$f":"'TAB 2-Measure Specifications'!L13","v":0},"Efficiency Units",{"$f":"'TAB 2-Measure Specifications'!M13","v":0}]
[{"$f":"'TAB 2-Measure Specifications'!D14","v":0},{"$f":"'TAB 1-Installation Report'!C16","v":0},{"$f":"'TAB 2-Measure Specifications'!G14","v":0},{"$f":"'TAB 2-Measure Specifications'!H14","v":0},{"$f":"IFERROR('TAB 1-Installation Report'!M16/W7,0)","v":0},0,0,0,0,{"$f":"IFERROR('TAB 1-Installation Report'!L16/W7,0)","v":0},{"$f":"IFERROR('TAB 1-Installation Report'!E16/W7,0)","v":0},{"$f":"IFERROR('TAB 1-Installation Report'!E16*VLOOKUP('TAB 2-Measure Specifications'!D14,MeasureLife,2,FALSE)/W7,0)","v":0},{"$f":"IFERROR('TAB 1-Installation Report'!F16/W7,0)","v":0},{"$f":"IFERROR('TAB 1-Installation Report'!F16*VLOOKUP('TAB 2-Measure Specifications'!D14,MeasureLife,2,FALSE)/W7,0)","v":0},{"$f":"IFERROR('TAB 1-Installation Report'!J6/W7,0)","v":0},{"$f":"IFERROR('TAB 1-Installation Report'!J16*VLOOKUP('TAB 2-Measure Specifications'!D14,MeasureLife,2,FALSE)/W7,0)","v":0},{"$f":"IFERROR('TAB 1-Installation Report'!J16/W7,0)","v":0},{"$f":"IFERROR('TAB 1-Installation Report'!J16*VLOOKUP('TAB 2-Measure Specifications'!D14,MeasureLife,2,FALSE)/W7,0)","v":0},{"$f":"IFERROR(SUM('TAB 1-Installation Report'!G17,'TAB 1-Installation Report'!H17,'TAB 1-Installation Report'!I17,'TAB 1-Installation Report'!K17)/W7,0)","v":0},{"$f":"IFERROR(SUM('TAB 1-Installation Report'!G17,'TAB 1-Installation Report'!H17,'TAB 1-Installation Report'!I17,'TAB 1-Installation Report'!K17)*VLOOKUP('TAB 2-Measure Specifications'!D14,MeasureLife,2,FALSE)/W7,0)","v":0},0,0,{"$f":"IFERROR('TAB 2-Measure Specifications'!K14*1,1)","v":0},"Capacity/Size",{"$f":"'TAB 2-Measure Specifications'!I14","v":0},"Capacity/Size Units",{"$f":"'TAB 2-Measure Specifications'!J14","v":0},"Efficiency",{"$f":"'TAB 2-Measure Specifications'!L14","v":0},"Efficiency Units",{"$f":"'TAB 2-Measure Specifications'!M14","v":0}]
[{"$f":"'TAB 2-Measure Specifications'!D15","v":0},{"$f":"'TAB 1-Installation Report'!C17","v":0},{"$f":"'TAB 2-Measure Specifications'!G15","v":0},{"$f":"'TAB 2-Measure Specifications'!H15","v":0},{"$f":"IFERROR('TAB 1-Installation Report'!M17/W8,0)","v":0},0,0,0,0,{"$f":"IFERROR('TAB 1-Installation Report'!L17/W8,0)","v":0},{"$f":"IFERROR('TAB 1-Installation Report'!E17/W8,0)","v":0},{"$f":"IFERROR('TAB 1-Installation Report'!E17*VLOOKUP('TAB 2-Measure Specifications'!D15,MeasureLife,2,FALSE)/W8,0)","v":0},{"$f":"IFERROR('TAB 1-Installation Report'!F17/W8,0)","v":0},{"$f":"IFERROR('TAB 1-Installation Report'!F17*VLOOKUP('TAB 2-Measure Specifications'!D15,MeasureLife,2,FALSE)/W8,0)","v":0},{"$f":"IFERROR('TAB 1-Installation Report'!J7/W8,0)","v":0},{"$f":"IFERROR('TAB 1-Installation Report'!J17*VLOOKUP('TAB 2-Measure Specifications'!D15,MeasureLife,2,FALSE)/W8,0)","v":0},{"$f":"IFERROR('TAB 1-Installation Report'!J17/W8,0)","v":0},{"$f":"IFERROR('TAB 1-Installation Report'!J17*VLOOKUP('TAB 2-Measure Specifications'!D15,MeasureLife,2,FALSE)/W8,0)","v":0},{"$f":"IFERROR(SUM('TAB 1-Installation Report'!G18,'TAB 1-Installation Report'!H18,'TAB 1-Installation Report'!I18,'TAB 1-Installation Report'!K18)/W8,0)","v":0},{"$f":"IFERROR(SUM('TAB 1-Installation Report'!G18,'TAB 1-Installation Report'!H18,'TAB 1-Installation Report'!I18,'TAB 1-Installation Report'!K18)*VLOOKUP('TAB 2-Measure Specifications'!D15,MeasureLife,2,FALSE)/W8,0)","v":0},0,0,{"$f":"IFERROR('TAB 2-Measure Specifications'!K15*1,1)","v":0},"Capacity/Size",{"$f":"'TAB 2-Measure Specifications'!I15","v":0},"Capacity/Size Units",{"$f":"'TAB 2-Measure Specifications'!J15","v":0},"Efficiency",{"$f":"'TAB 2-Measure Specifications'!L15","v":0},"Efficiency Units",{"$f":"'TAB 2-Measure Specifications'!M15","v":0}]
[{"$f":"'TAB 2-Measure Specifications'!D16","v":0},{"$f":"'TAB 1-Installation Report'!C18","v":0},{"$f":"'TAB 2-Measure Specifications'!G16","v":0},{"$f":"'TAB 2-Measure Specifications'!H16","v":0},{"$f":"IFERROR('TAB 1-Installation Report'!M18/W9,0)","v":0},0,0,0,0,{"$f":"IFERROR('TAB 1-Installation Report'!L18/W9,0)","v":0},{"$f":"IFERROR('TAB 1-Installation Report'!E18/W9,0)","v":0},{"$f":"IFERROR('TAB 1-Installation Report'!E18*VLOOKUP('TAB 2-Measure Specifications'!D16,MeasureLife,2,FALSE)/W9,0)","v":0},{"$f":"IFERROR('TAB 1-Installation Report'!F18/W9,0)","v":0},{"$f":"IFERROR('TAB 1-Installation Report'!F18*VLOOKUP('TAB 2-Measure Specifications'!D16,MeasureLife,2,FALSE)/W9,0)","v":0},{"$f":"IFERROR('TAB 1-Installation Report'!J8/W9,0)","v":0},{"$f":"IFERROR('TAB 1-Installation Report'!J18*VLOOKUP('TAB 2-Measure Specifications'!D16,MeasureLife,2,FALSE)/W9,0)","v":0},{"$f":"IFERROR('TAB 1-Installation Report'!J18/W9,0)","v":0},{"$f":"IFERROR('TAB 1-Installation Report'!J18*VLOOKUP('TAB 2-Measure Specifications'!D16,MeasureLife,2,FALSE)/W9,0)","v":0},{"$f":"IFERROR(SUM('TAB 1-Installation Report'!G19,'TAB 1-Installation Report'!H19,'TAB 1-Installation Report'!I19,'TAB 1-Installation Report'!K19)/W9,0)","v":0},{"$f":"IFERROR(SUM('TAB 1-Installation Report'!G19,'TAB 1-Installation Report'!H19,'TAB 1-Installation Report'!I19,'TAB 1-Installation Report'!K19)*VLOOKUP('TAB 2-Measure Specifications'!D16,MeasureLife,2,FALSE)/W9,0)","v":0},0,0,{"$f":"IFERROR('TAB 2-Measure Specifications'!K16*1,1)","v":0},"Capacity/Size",{"$f":"'TAB 2-Measure Specifications'!I16","v":0},"Capacity/Size Units",{"$f":"'TAB 2-Measure Specifications'!J16","v":0},"Efficiency",{"$f":"'TAB 2-Measure Specifications'!L16","v":0},"Efficiency Units",{"$f":"'TAB 2-Measure Specifications'!M16","v":0}]
[{"$f":"'TAB 2-Measure Specifications'!D17","v":0},{"$f":"'TAB 1-Installation Report'!C19","v":0},{"$f":"'TAB 2-Measure Specifications'!G17","v":0},{"$f":"'TAB 2-Measure Specifications'!H17","v":0},{"$f":"IFERROR('TAB 1-Installation Report'!M19/W10,0)","v":0},0,0,0,0,{"$f":"IFERROR('TAB 1-Installation Report'!L19/W10,0)","v":0},{"$f":"IFERROR('TAB 1-Installation Report'!E19/W10,0)","v":0},{"$f":"IFERROR('TAB 1-Installation Report'!E19*VLOOKUP('TAB 2-Measure Specifications'!D17,MeasureLife,2,FALSE)/W10,0)","v":0},{"$f":"IFERROR('TAB 1-Installation Report'!F19/W10,0)","v":0},{"$f":"IFERROR('TAB 1-Installation Report'!F19*VLOOKUP('TAB 2-Measure Specifications'!D17,MeasureLife,2,FALSE)/W10,0)","v":0},{"$f":"IFERROR('TAB 1-Installation Report'!J9/W10,0)","v":0},{"$f":"IFERROR('TAB 1-Installation Report'!J19*VLOOKUP('TAB 2-Measure Specifications'!D17,MeasureLife,2,FALSE)/W10,0)","v":0},{"$f":"IFERROR('TAB 1-Installation Report'!J19/W10,0)","v":0},{"$f":"IFERROR('TAB 1-Installation Report'!J19*VLOOKUP('TAB 2-Measure Specifications'!D17,MeasureLife,2,FALSE)/W10,0)","v":0},{"$f":"IFERROR(SUM('TAB 1-Installation Report'!G20,'TAB 1-Installation Report'!H20,'TAB 1-Installation Report'!I20,'TAB 1-Installation Report'!K20)/W10,0)","v":0},{"$f":"IFERROR(SUM('TAB 1-Installation Report'!G20,'TAB 1-Installation Report'!H20,'TAB 1-Installation Report'!I20,'TAB 1-Installation Report'!K20)*VLOOKUP('TAB 2-Measure Specifications'!D17,MeasureLife,2,FALSE)/W10,0)","v":0},0,0,{"$f":"IFERROR('TAB 2-Measure Specifications'!K17*1,1)","v":0},"Capacity/Size",{"$f":"'TAB 2-Measure Specifications'!I17","v":0},"Capacity/Size Units",{"$f":"'TAB 2-Measure Specifications'!J17","v":0},"Efficiency",{"$f":"'TAB 2-Measure Specifications'!L17","v":0},"Efficiency Units",{"$f":"'TAB 2-Measure Specifications'!M17","v":0}]
{"$rows_left_out":19}
{"sheet":"Export","index":4,"n_rows":3,"n_cols":50,"rows_kept":3,"cut":false,"hidden":true,"merged":[]}
["Pay For Performance - Existing Buildings: 2016"]
["Project Name",0,"Project ID",0,"Street Address",0,"Project SF",0,"CM Fees",0,"Partner Fees",0,"Total Measure Cost",0,"Committed Incentive #1",0,"Paid Incentive #1",0,"Committed Incentive #2",0,"Paid Incentive #2",0,"Committed Incentive #3",0,"Paid Incentive #3",0,"Annual Energy Cost",0,"Annual Cost Savings",0,"Internal Rate of Return (IRR)",0,"Life Cycle Savings",0,"Simple Payback (yrs)",0,"Simple Payback with NJCEP Incentive (yrs)",0,"Peak kW",0,"Total % Savings",0,"% Elec",0,"% Gas",0,"% Oil or Propane",0,"% Other",0]
["Measure Name","Measure Description","Manufacturer","Model","Installation Cost per Unit","Annual Energy Cost Savings per Unit","Incentive Per Unit","Simple Payback w/o Incentives","Simple Payback w/ Incentives","Peak Demand Reduction per Unit","Annual Electricity Savings per Unit","Lifetime Electricity Savings per Unit","Annual Gas Savings per Unit","Lifetime Gas Savings per Unit","Annual Propane Savings per Unit","Lifetime Propane Savings per Unit","Annual Oil Savings per Unit","Lifetime Oil Savings per Unit","Other Energy Savings MMBTU per Unit","Other Lifetime Energy Savings MMBTU per Unit","CO2e Emissions Reduction per Unit (lbs)","Quantity Committed","Quantity Installed"]