{"text_format":"1","workbook":"xlsx","n_sheets":15,"sheets":["COVER","Input >>>","I_Generiek","I_Verdeelsleutel","I_Kosten","I_Omzet","I_Investeringen","I_Financiering","Calc >>>","C_Base","C_Scenario","Output >>>","O_Dashboard","O_Graph","CHECK"],"not_rendered":{"charts":12,"images":8,"macros":1,"external_links":0,"defined_names":7,"comments":0,"pivot_tables":0},"unopened":[],"bounds":{"document_bytes":16777216,"sheet_cells":100000,"rows_first":2000,"rows_last":500,"rows_between":2000,"halvings":0,"cell_chars":16384,"cell_head_chars":4096},"cells_cut":0,"cells_raw":0,"read":"whole","date_system":"1900"}

{"sheet":"COVER","index":0,"n_rows":12,"n_cols":3,"rows_kept":12,"cut":false,"hidden":false,"merged":[[12,2,12,4],[23,2,24,13],[5,2,5,4],[14,2,19,13]]}
[]
[]
[]
[]
[null,null,"BOVAG"]
[null,null,"Kostprijsmodel \n(Gemotoriseerde) Tweewielers"]
[]
[]
[]
[]
[]
[null,null,"Finale versie"]

{"sheet":"Input >>>","index":1,"n_rows":13,"n_cols":3,"rows_kept":13,"cut":false,"hidden":false,"merged":[]}
[]
[]
[]
[]
[]
[]
[]
[]
[]
[]
[]
[]
[null,null,"Input >>>"]

{"sheet":"I_Generiek","index":2,"n_rows":213,"n_cols":6,"rows_kept":213,"cut":false,"hidden":false,"merged":[]}
[null,null,{"$f":"COVER!C5&\" | \"&COVER!C6&\" | \"&A3","v":"BOVAG | Kostprijsmodel \n(Gemotoriseerde) Tweewielers | I_Generiek"}]
[]
[{"$f":"MID(CELL(\"filename\",B3),FIND(\"]\",CELL(\"filename\",B3))+1,99)","v":"I_Generiek"}]
[null,null,"Generiek"]
[]
[]
[null,null,"0.","Het (volledige) jaar waarvoor de gegevens ingevuld worden"]
[]
[null,null,null,null,"Jaar"]
[]
[]
[null,null,"1.",{"$f":"\"Gefactureerde uren \"&$F$9","v":"Gefactureerde uren "}]
[]
[null,null,null,"1.1",{"$f":"\"Extern gefactureerde uren \"&$F$9","v":"Extern gefactureerde uren "}]
[]
[null,null,null,null,"Eenheid",{"$f":"\"Gefactureerde uren \"&$F$9","v":"Gefactureerde uren "}]
[]
[null,null,null,null,"Extern gefactureerde uren"]
[]
[null,null,null,"1.2",{"$f":"\"Intern gefactureerde uren \"&F9","v":"Intern gefactureerde uren "}]
{"$rows_left_out":194}
{"sheet":"I_Verdeelsleutel","index":3,"n_rows":18,"n_cols":12,"rows_kept":18,"cut":false,"hidden":false,"merged":[]}
[null,null,{"$f":"COVER!C5&\" | \"&COVER!C6&\" | \"&A3","v":"BOVAG | Kostprijsmodel \n(Gemotoriseerde) Tweewielers | I_Verdeelsleutel"}]
[]
[{"$f":"MID(CELL(\"filename\",B3),FIND(\"]\",CELL(\"filename\",B3))+1,99)","v":"I_Verdeelsleutel"}]
[null,null,"Verdeelsleutel"]
[]
[]
[null,null,"1.","Verdeelsleutel voor kosten"]
[]
[null,null,null,null,"Verdeelsleutel","Eenheid","Totaal","Behorende aan werkplaats","Behorende aan Sales","% werkplaats","Check"]
[]
[null,null,null,null,"Percentage",{"$f":"IF(E11=\"\",\"\",\"%\")","v":"%"},1,null,null,{"$f":"IFERROR($H11/SUM($H11:$I11),\"\")","v":""},{"$f":"IF(AND(SUM(H11:I11)=G11,G11<>\"\",E11:G11<>\"\"),TRUE,FALSE)","v":false},{"$f":"IF(AND($G11<>SUM($H11:$I11),SUM($H11:$I11)<>0),\"Let op: Het Totaal komt niet overeen met de optelling van werkplaats en Sales\",\"\")","v":""}]
[null,null,null,null,"Omzet","EUR",null,null,null,{"$f":"IFERROR($H12/SUM($H12:$I12),\"\")","v":""},{"$f":"IF(AND(SUM(H12:I12)=G12,G12<>\"\",E12:G12<>\"\"),TRUE,FALSE)","v":false},{"$f":"IF(AND($G12<>SUM($H12:$I12),SUM($H12:$I12)<>0),\"Let op: Het Totaal komt niet overeen met de optelling van werkplaats en Sales\",\"\")","v":""}]
[null,null,null,null,"Kosten","EUR",null,null,null,"",{"$f":"IF(AND(SUM(H13:I13)=G13,G13<>\"\",E13:G13<>\"\"),TRUE,FALSE)","v":false},""]
[null,null,null,null,"Aantal medewerkers","Aantal",null,null,null,"",{"$f":"IF(AND(SUM(H14:I14)=G14,G14<>\"\",E14:G14<>\"\"),TRUE,FALSE)","v":false},""]
[null,null,null,null,"Gebruiksoppervlak","m²",null,null,null,"",{"$f":"IF(AND(SUM(H15:I15)=G15,G15<>\"\",E15:G15<>\"\"),TRUE,FALSE)","v":false},""]
[null,null,null,null,null,null,null,null,null,"",{"$f":"IF(AND(SUM(H16:I16)=G16,G16<>\"\",E16:G16<>\"\"),TRUE,FALSE)","v":false},""]
[null,null,null,null,null,null,null,null,null,"",{"$f":"IF(AND(SUM(H17:I17)=G17,G17<>\"\",E17:G17<>\"\"),TRUE,FALSE)","v":false},""]
[null,null,null,null,null,null,null,null,null,"",{"$f":"IF(AND(SUM(H18:I18)=G18,G18<>\"\",E18:G18<>\"\"),TRUE,FALSE)","v":false},""]

{"sheet":"I_Kosten","index":4,"n_rows":114,"n_cols":13,"rows_kept":114,"cut":false,"hidden":false,"merged":[]}
[null,null,{"$f":"COVER!C5&\" | \"&COVER!C6&\" | \"&A3","v":"BOVAG | Kostprijsmodel \n(Gemotoriseerde) Tweewielers | I_Kosten"}]
[]
[{"$f":"MID(CELL(\"filename\",B3),FIND(\"]\",CELL(\"filename\",B3))+1,99)","v":"I_Kosten"}]
[null,null,{"$f":"\"Kosten \"&I_Generiek!$F$9","v":"Kosten "}]
[null,null,null,null,null,null,"Keuze",null,"Eenheid",null,{"$f":"I_Generiek!$F$9","v":0},null,"Verdeelsleutel"]
[]
[null,null,"0.","Totale bedrijfskosten"]
[]
[null,null,null,"0.1","Totale bedrijfskosten (alle directe + indirecte kosten)"]
[]
[null,null,"1.","Personele lasten direct personeel"]
[]
[null,null,null,"1.1","Personeelskosten op meer detail niveau invullen?"]
[]
[null,null,null,"1.2","Totale personeelskosten direct personeel (excl. opleidingskosten)",null,null,null,"EUR / jaar"]
[]
[null,null,null,null,"1.2.1","Brutolonen",null,null,"EUR / jaar"]
[]
[null,null,null,null,"1.2.2","Sociale-en werkgeverslasten",null,null,"EUR / jaar"]
[]
{"$rows_left_out":95}
{"sheet":"I_Omzet","index":5,"n_rows":13,"n_cols":13,"rows_kept":13,"cut":false,"hidden":false,"merged":[]}
[null,null,{"$f":"COVER!C5&\" | \"&COVER!C6&\" | \"&A3","v":"BOVAG | Kostprijsmodel \n(Gemotoriseerde) Tweewielers | I_Omzet"}]
[]
[{"$f":"MID(CELL(\"filename\",B3),FIND(\"]\",CELL(\"filename\",B3))+1,99)","v":"I_Omzet"}]
[null,null,{"$f":"\"Netto omzet en inkoopwaarde voorraad \" &I_Generiek!$F$9","v":"Netto omzet en inkoopwaarde voorraad "}]
[null,null,null,null,null,null,"Keuze",null,"Eenheid",null,{"$f":"I_Generiek!$F$9","v":0},null,"Verdeelsleutel"]
[]
[null,null,"1.","Netto omzet en materiaalkosten"]
[]
[null,null,null,"1.1","Hebben de ingevulde kosten (op tabblad I_Kosten) enkel betrekking op werkplaats-activiteiten?"]
[]
[null,null,null,"1.2",{"$f":"IF($G$9=\"Ja\",\"Netto omzet - werkplaats\",IF($G$9=\"Nee\",\"Netto omzet - op bedrijfsniveau\",\"Netto omzet\"))","v":"Netto omzet"},null,null,null,"EUR / jaar"]
[]
[null,null,null,"1.3",{"$f":"IF($G$9=\"Ja\",\"Inkoopwaarde voorraad - werkplaats\",IF($G$9=\"Nee\",\"Inkoopwaarde voorraad - op bedrijfsniveau\",\"Inkoopwaarde voorraad\"))","v":"Inkoopwaarde voorraad"},null,null,null,"EUR / jaar"]

{"sheet":"I_Investeringen","index":6,"n_rows":72,"n_cols":15,"rows_kept":72,"cut":false,"hidden":false,"merged":[]}
[null,null,{"$f":"COVER!C5&\" | \"&COVER!C6&\" | \"&A3","v":"BOVAG | Kostprijsmodel \n(Gemotoriseerde) Tweewielers | I_Investeringen"}]
[]
[{"$f":"MID(CELL(\"filename\",B3),FIND(\"]\",CELL(\"filename\",B3))+1,99)","v":"I_Investeringen"}]
[null,null,{"$f":"\"Nieuwe investeringen \"&I_Generiek!$F$9","v":"Nieuwe investeringen "}]
[null,null,null,null,null,null,"Keuze",null,"Eenheid",null,{"$f":"I_Generiek!$F$9","v":0},null,"Verdeelsleutel",null,"Directe / indirecte afschrijvingslasten"]
[]
[null,null,"1.","Extra investeringen"]
[]
[null,null,null,"1.1","Eenvoudige invoer voor extra investeringen?",null,null,null,null,null,{"$f":"IF(AND($G9<>\"\",OR(I_Kosten!$G$37=\"\",I_Kosten!$G$37=\"Nee\")),\"Let op: de keuze op tabblad I_Kosten geeft aan dat er geen extra investeringen meegenomen hoeven te worden\",\"\")","v":""}]
[null,null,null,null,"Nieuwe directe afschrijvingslasten (eenvoudige invoer)",null,null,null,"EUR / jaar",null,null,null,null,null,"Direct"]
[null,null,null,null,"Nieuwe indirecte afschrijvingslasten (eenvoudige invoer)",null,null,null,"EUR / jaar",null,null,null,null,null,"Indirect"]
[]
[null,null,null,"1.2","Extra investeringen (detail invoer)"]
[]
[null,null,null,null,"1.2.1","Investeringscategorieën"]
[]
[]
[]
[]
[]
{"$rows_left_out":53}
{"sheet":"I_Financiering","index":7,"n_rows":44,"n_cols":13,"rows_kept":44,"cut":false,"hidden":false,"merged":[]}
[null,null,{"$f":"COVER!C5&\" | \"&COVER!C6&\" | \"&A3","v":"BOVAG | Kostprijsmodel \n(Gemotoriseerde) Tweewielers | I_Financiering"}]
[]
[{"$f":"MID(CELL(\"filename\",B3),FIND(\"]\",CELL(\"filename\",B3))+1,99)","v":"I_Financiering"}]
[null,null,{"$f":"\"Nieuwe rentelasten \"&I_Generiek!$F$9","v":"Nieuwe rentelasten "}]
[null,null,null,null,null,null,"Keuze",null,"Eenheid",null,{"$f":"I_Generiek!$F$9","v":0},null,"Verdeelsleutel"]
[]
[null,null,"1.","Nieuwe rentelasten"]
[]
[null,null,null,"1.1","Eenvoudige invoer voor nieuwe rentelasten?",null,null,null,null,null,{"$f":"IF(AND($G9<>\"\",OR(I_Kosten!$G$43=\"\",I_Kosten!$G$43=\"Nee\")),\"Let op: de keuze op tabblad I_Kosten geeft aan dat er geen nieuwe rentelasten meegenomen hoeven te worden\",\"\")","v":""}]
[null,null,null,null,"Nieuwe rentelasten (eenvoudige invoer)",null,null,null,"EUR / jaar"]
[]
[null,null,null,"1.2","Nieuwe rentelasten (detail invoer)"]
[]
[null,null,null,null,"1.2.1","Wilt u deze invoervelden activeren?"]
[null,null,null,null,null,"Financieringsbedrag",null,null,"EUR"]
[null,null,null,null,null,"Rentepercentage ",null,null,"% / jaar"]
[]
[null,null,null,null,"1.2.2","Wilt u deze invoervelden activeren?"]
[null,null,null,null,null,"Financieringsbedrag",null,null,"EUR"]
[null,null,null,null,null,"Rentepercentage",null,null,"% / jaar"]
{"$rows_left_out":25}
{"sheet":"Calc >>>","index":8,"n_rows":13,"n_cols":3,"rows_kept":13,"cut":false,"hidden":false,"merged":[]}
[]
[]
[]
[]
[]
[]
[]
[]
[]
[]
[]
[]
[null,null,"Calc >>>"]

{"sheet":"C_Base","index":9,"n_rows":337,"n_cols":17,"rows_kept":337,"cut":false,"hidden":false,"merged":[]}
[null,null,{"$f":"COVER!C5&\" | \"&COVER!C6&\" | \"&A3","v":"BOVAG | Kostprijsmodel \n(Gemotoriseerde) Tweewielers | C_Base"}]
[]
[{"$f":"MID(CELL(\"filename\",B3),FIND(\"]\",CELL(\"filename\",B3))+1,99)","v":"C_Base"}]
[null,null,"Calculatie_Base"]
[null,null,null,null,null,null,null,null,null,null,"Input",null,"Verdeelsleutel",null,"% werkplaats",null,"Berekening werkplaats"]
[]
[null,null,"1.","Personeelskosten"]
[]
[null,null,null,"1.1",null,"Direct personeel - personeelskosten (excl. opleidingskosten) - Eenvoudige invoer",null,null,null,{"$f":"IF(J13=\"Ja\",\"Nee\",IF(J13=0,0,\"Ja\"))","v":0}]
[]
[null,null,null,null,null,{"$f":"I_Kosten!E15","v":"Totale personeelskosten direct personeel (excl. opleidingskosten)"},null,null,"EUR / jaar",null,{"$f":"IF($J$9=\"Ja\",I_Kosten!K15,0)","v":0},null,{"$f":"I_Kosten!M15","v":0},null,{"$f":"IFERROR(INDEX(I_Verdeelsleutel!$J$11:$J$18,MATCH($M11,I_Verdeelsleutel!$E$11:$E$18,0)),\"\")","v":""},null,{"$f":"IFERROR(INDEX(I_Verdeelsleutel!$J$11:$J$18,MATCH($M11,I_Verdeelsleutel!$E$11:$E$18,0))*$K11,0)","v":0}]
[]
[null,null,null,"1.2",null,"Direct personeel - personeelskosten (excl. opleidingskosten) - Detail invoer",null,null,null,{"$f":"I_Kosten!G13","v":0}]
[]
[null,null,null,null,null,{"$f":"I_Kosten!F17","v":"Brutolonen"},null,null,"EUR / jaar",null,{"$f":"IF($J$13=\"Ja\",I_Kosten!K17,0)","v":0},null,{"$f":"I_Kosten!M17","v":0},null,{"$f":"IFERROR(INDEX(I_Verdeelsleutel!$J$11:$J$18,MATCH($M15,I_Verdeelsleutel!$E$11:$E$18,0)),\"\")","v":""},null,{"$f":"IFERROR(INDEX(I_Verdeelsleutel!$J$11:$J$18,MATCH($M15,I_Verdeelsleutel!$E$11:$E$18,0))*$K15,0)","v":0}]
[null,null,null,null,null,{"$f":"I_Kosten!F19","v":"Sociale-en werkgeverslasten"},null,null,"EUR / jaar",null,{"$f":"IF($J$13=\"Ja\",I_Kosten!K19,0)","v":0},null,{"$f":"I_Kosten!M19","v":0},null,{"$f":"IFERROR(INDEX(I_Verdeelsleutel!$J$11:$J$18,MATCH($M16,I_Verdeelsleutel!$E$11:$E$18,0)),\"\")","v":""},null,{"$f":"IFERROR(INDEX(I_Verdeelsleutel!$J$11:$J$18,MATCH($M16,I_Verdeelsleutel!$E$11:$E$18,0))*$K16,0)","v":0}]
[null,null,null,null,null,{"$f":"I_Kosten!F21","v":"Overige personeelskosten"},null,null,"EUR / jaar",null,{"$f":"IF($J$13=\"Ja\",I_Kosten!K21,0)","v":0},null,{"$f":"I_Kosten!M21","v":0},null,{"$f":"IFERROR(INDEX(I_Verdeelsleutel!$J$11:$J$18,MATCH($M17,I_Verdeelsleutel!$E$11:$E$18,0)),\"\")","v":""},null,{"$f":"IFERROR(INDEX(I_Verdeelsleutel!$J$11:$J$18,MATCH($M17,I_Verdeelsleutel!$E$11:$E$18,0))*$K17,0)","v":0}]
[]
[null,null,null,"1.3",null,"Totale personeelskosten direct personeel (excl. opleidingskosten)"]
[]
{"$rows_left_out":318}
{"sheet":"C_Scenario","index":10,"n_rows":229,"n_cols":17,"rows_kept":229,"cut":false,"hidden":false,"merged":[]}
[null,null,{"$f":"COVER!C5&\" | \"&COVER!C6&\" | \"&A3","v":"BOVAG | Kostprijsmodel \n(Gemotoriseerde) Tweewielers | C_Scenario"}]
[]
[{"$f":"MID(CELL(\"filename\",B3),FIND(\"]\",CELL(\"filename\",B3))+1,99)","v":"C_Scenario"}]
[null,null,"Calculatie_Scenario"]
[null,null,null,null,null,null,null,null,null,null,"Base werkplaats",null,"Gekozen draaiknop (%)",null,"Scenario werkplaats",null,"Scenario actief?"]
[]
[null,null,"1.","Personeelskosten"]
[]
[null,null,null,"1.1",null,"Direct personeel - personeelskosten (excl. opleidingskosten)"]
[]
[null,null,null,null,"1.1.1","Draaiknoppen van toepassing - Directe personeelskosten (excl. opleidingskosten)"]
[]
[null,null,null,null,null,{"$f":"O_Dashboard!M11","v":"CAO-ontwikkeling"},null,null,{"$f":"IF(O_Dashboard!$O$15=TRUE,O_Dashboard!$P$13,0)","v":0}]
[null,null,null,null,null,{"$f":"O_Dashboard!$M$20","v":"Krapte arbeidsmarkt"},null,null,{"$f":"IF(O_Dashboard!$O$22=TRUE,O_Dashboard!$P$22,0)","v":0}]
[null,null,null,null,null,{"$f":"O_Dashboard!$M$26","v":"Parttime werken"},null,null,{"$f":"IF(O_Dashboard!O28=TRUE,O_Dashboard!$P$28,0)","v":0}]
[]
[null,null,null,null,"1.1.2","Totale impact van de gekozen draaiknoppen",null,null,{"$f":"SUM(I13:I15)","v":0}]
[]
[null,null,null,null,"1.1.3","Totale personeelskosten direct personeel (excl. opleidingskosten)"]
[]
{"$rows_left_out":210}
{"sheet":"Output >>>","index":11,"n_rows":13,"n_cols":3,"rows_kept":13,"cut":false,"hidden":false,"merged":[]}
[]
[]
[]
[]
[]
[]
[]
[]
[]
[]
[]
[]
[null,null,"Output >>>"]

{"sheet":"O_Dashboard","index":12,"n_rows":117,"n_cols":39,"rows_kept":117,"cut":false,"hidden":false,"merged":[[116,23,116,24],[114,23,114,24],[115,23,115,24],[100,23,100,24],[101,23,101,24],[104,23,104,24],[105,23,105,24],[106,23,106,24],[112,23,112,24],[107,23,107,24],[108,23,108,24],[109,23,109,24],[110,23,110,24],[111,23,111,24],[95,23,95,24],[102,23,102,24],[103,23,103,24],[92,23,92,24],[93,23,93,24],[94,23,94,24],[96,23,96,24],[99,23,99,24],[87,23,87,24],[88,23,88,24],[89,23,89,24],[90,23,90,24],[91,23,91,24],[80,23,80,24],[81,23,81,24],[82,23,82,24],[85,23,85,24],[86,23,86,24],[78,23,78,24],[65,11,65,12],[68,11,68,12],[69,11,69,12],[72,11,72,12],[73,11,73,12],[56,11,56,12],[92,11,92,12],[93,11,93,12],[85,11,85,12],[76,11,76,12],[77,11,77,12],[80,11,80,12],[81,11,81,12],[84,11,84,12],[57,11,57,12],[60,11,60,12],[61,11,61,12],[64,11,64,12]]}
[null,null,{"$f":"COVER!C5&\" | \"&COVER!C6&\" | \"&A3","v":"BOVAG | Kostprijsmodel \n(Gemotoriseerde) Tweewielers | O_Dashboard"}]
[null,null,null,null,null,null,null,null,null,null,null,null,null,null,null,null,null,null,null,null,null,null,"Gemiddelde kostprijzen per uur - SCENARIO"]
[{"$f":"MID(CELL(\"filename\",B3),FIND(\"]\",CELL(\"filename\",B3))+1,99)","v":"O_Dashboard"},null,null,null,null,null,null,null,null,null,null,null,null,null,null,null,null,null,null,null,null,null,"Gemiddelde kostprijs o.b.v. extern gefactureerde uren",null,null,null,null,null,null,null,{"$f":"O_Graph!H43","v":0}]
[null,null,"Dashboard",null,null,null,null,null,null,null,null,null,{"$f":"IF(CHECK!H9=0,\"Alles is juist ingevuld\",\"Er is iets niet juist ingevuld, controleer het tabblad CHECK om te zien wat er ontbreekt\")","v":"Er is iets niet juist ingevuld, controleer het tabblad CHECK om te zien wat er ontbreekt"},null,null,null,null,null,null,null,null,null,"Gemiddelde kostprijs o.b.v. intern gefactureerde uren",null,null,null,null,null,null,null,{"$f":"IFERROR(IF(L94=\"\",C_Base!Q280/O_Dashboard!G94,C_Base!Q280/O_Dashboard!L94),0)","v":0}]
[]
[]
[null,null,"1.","Scenario analyse",null,null,null,null,null,null,null,null,null,null,null,null,null,null,"2.","Gemiddelde kostprijs werkplaats - INPUT",null,null,null,null,null,null,null,null,null,null,null,"4.","Verschil gemiddelde kostprijzen"]
[]
[null,null,null,"1.1","Kostenstijgingen / -dalingen",null,null,null,"% / jaar",null,null,null,"1.2","CAO-ontwikkeling",null,"% / jaar"]
[null,null,null,null,null,null,null,null,null,null,null,null,null,null,null,null,null,null,null,null,null,null,null,null,null,null,null,null,null,null,null,null,"Verschil kostprijzen",null,null,"Eenheid","INPUT","SCENARIO","Verschil"]
[null,null,null,"Directe overige kosten",null,null,null,null,null,null,null,null,"CAO-ontwikkeling"]
[null,null,null,null,null,null,null,null,null,null,null,null,null,null,null,null,null,null,null,null,null,null,null,null,null,null,null,null,null,null,null,null,{"$f":"C_Scenario!F184","v":"Directe personeelskosten"},null,null,"EUR / uur",{"$f":"C_Scenario!K184","v":0},{"$f":"C_Scenario!O184","v":0},{"$f":"AL12-AK12","v":0}]
[null,null,null,{"$f":"C_Base!F220","v":"Huisvestingskosten"},null,null,null,1000,{"$f":"IF(D13=\"\",\"\",(H13-1000)/1000)","v":0},null,null,null,null,"Loonstijging conform CAO",null,0,null,null,null,null,null,null,null,null,null,null,null,null,null,null,null,null,{"$f":"C_Scenario!F185","v":"Indirecte personeelskosten"},null,null,"EUR / uur",{"$f":"C_Scenario!K185","v":0},{"$f":"C_Scenario!O185","v":0},{"$f":"AL13-AK13","v":0}]
[null,null,null,{"$f":"C_Base!F237","v":"Leasekosten werkplaatsapparatuur"},null,null,null,1000,{"$f":"IF(D14=\"\",\"\",(H14-1000)/1000)","v":0},null,null,null,null,null,null,null,null,null,null,null,null,null,null,null,null,null,null,null,null,null,null,null,{"$f":"C_Scenario!F186","v":"Directe afschrijvingslasten"},null,null,"EUR / uur",{"$f":"C_Scenario!K186","v":0},{"$f":"C_Scenario!O186","v":0},0]
[null,null,null,{"$f":"C_Base!F238","v":"Kosten gereedschappen klein"},null,null,null,1000,0,null,null,null,null,{"$f":"C_Base!F21","v":"Totale personeelskosten direct personeel (excl. opleidingskosten)"},false,null,null,null,null,null,null,null,null,null,null,null,null,null,null,null,null,null,{"$f":"C_Scenario!F187","v":"Indirecte afschrijvingslasten"},null,null,"EUR / uur",{"$f":"C_Scenario!K187","v":0},{"$f":"C_Scenario!O187","v":0},0]
[null,null,null,{"$f":"C_Base!F239","v":"Garantiekosten"},null,null,null,1000,0,null,null,null,null,{"$f":"C_Base!F33","v":"Totale personeelskosten indirect personeel (excl. opleidingskosten)"},false,null,null,null,null,null,null,null,null,null,null,null,null,null,null,null,null,null,{"$f":"C_Scenario!F188","v":"Rentelasten"},null,null,"EUR / uur",{"$f":"C_Scenario!K188","v":0},{"$f":"C_Scenario!O188","v":0},0]
[null,null,null,{"$f":"C_Base!F240","v":"Franchisekosten"},null,null,null,1000,0,null,null,null,null,null,null,null,null,null,null,null,null,null,null,null,null,null,null,null,null,null,null,null,{"$f":"C_Scenario!F189","v":"Directe overige kosten"},null,null,"EUR / uur",{"$f":"C_Scenario!K189","v":0},{"$f":"C_Scenario!O189","v":0},0]
[null,null,null,{"$f":"C_Base!F241","v":"Transportkosten"},null,null,null,1000,0,null,null,null,"1.3","Krapte arbeidsmarkt",null,"% / jaar",null,null,null,null,null,null,null,null,null,null,null,null,null,null,null,null,{"$f":"C_Scenario!F190","v":"Indirecte overige kosten"},null,null,"EUR / uur",{"$f":"C_Scenario!K190","v":0},{"$f":"C_Scenario!O190","v":0},0]
[null,null,null,{"$f":"C_Base!F242","v":""},null,null,null,1000,"",null,null,null,null,null,null,null,null,null,null,null,null,null,null,null,null,null,null,null,null,null,null,null,"Gemiddelde kostprijs per uur",null,null,"EUR / uur",{"$f":"SUM(AK12:AK18)","v":0},{"$f":"SUM(AL12:AL18)","v":0},0]
[null,null,null,{"$f":"C_Base!F243","v":""},null,null,null,1000,"",null,null,null,"Krapte arbeidsmarkt"]
{"$rows_left_out":98}
{"sheet":"O_Graph","index":13,"n_rows":117,"n_cols":16,"rows_kept":117,"cut":false,"hidden":false,"merged":[]}
[null,null,{"$f":"COVER!C5&\" | \"&COVER!C6&\" | \"&A3","v":"BOVAG | Kostprijsmodel \n(Gemotoriseerde) Tweewielers | O_Graph"}]
[]
[{"$f":"MID(CELL(\"filename\",B3),FIND(\"]\",CELL(\"filename\",B3))+1,99)","v":"O_Graph"}]
[null,null,"Calculaties voor dashboard"]
[]
[]
[null,null,"1.","Waterval 1 - INPUT"]
[]
[null,null,null,"1.1","Kostprijs werkplaats",null,null,"Kosten","Rank"]
[]
[null,null,null,null,{"$f":"C_Base!F292","v":"Directe personeelskosten"},null,null,{"$f":"C_Base!Q292","v":0},{"$f":"IF(H11=0,\"\",RANK(H11,IF($H$11:$H$17>0,$H$11:$H$17,0))+COUNTIF($H$11:$H11,$H11)-1)","v":""}]
[null,null,null,null,{"$f":"C_Base!F293","v":"Indirecte personeelskosten"},null,null,{"$f":"C_Base!Q293","v":0},{"$f":"IF(H12=0,\"\",RANK(H12,IF($H$11:$H$17>0,$H$11:$H$17,0))+COUNTIF($H$11:$H12,$H12)-1)","v":""}]
[null,null,null,null,{"$f":"C_Base!F294","v":"Directe afschrijvingslasten"},null,null,{"$f":"C_Base!Q294","v":0},{"$f":"IF(H13=0,\"\",RANK(H13,IF($H$11:$H$17>0,$H$11:$H$17,0))+COUNTIF($H$11:$H13,$H13)-1)","v":""}]
[null,null,null,null,{"$f":"C_Base!F295","v":"Indirecte afschrijvingslasten"},null,null,{"$f":"C_Base!Q295","v":0},{"$f":"IF(H14=0,\"\",RANK(H14,IF($H$11:$H$17>0,$H$11:$H$17,0))+COUNTIF($H$11:$H14,$H14)-1)","v":""}]
[null,null,null,null,{"$f":"C_Base!F296","v":"Rentelasten"},null,null,{"$f":"C_Base!Q296","v":0},{"$f":"IF(H15=0,\"\",RANK(H15,IF($H$11:$H$17>0,$H$11:$H$17,0))+COUNTIF($H$11:$H15,$H15)-1)","v":""}]
[null,null,null,null,{"$f":"C_Base!F297","v":"Directe overige kosten"},null,null,{"$f":"C_Base!Q297","v":0},{"$f":"IF(H16=0,\"\",RANK(H16,IF($H$11:$H$17>0,$H$11:$H$17,0))+COUNTIF($H$11:$H16,$H16)-1)","v":""}]
[null,null,null,null,{"$f":"C_Base!F298","v":"Indirecte overige kosten"},null,null,{"$f":"C_Base!Q298","v":0},{"$f":"IF(H17=0,\"\",RANK(H17,IF($H$11:$H$17>0,$H$11:$H$17,0))+COUNTIF($H$11:$H17,$H17)-1)","v":""}]
[null,null,null,null,"Totale kostprijs",null,null,{"$f":"SUM(H11:H17)","v":0}]
[]
[null,null,null,"1.2","Waterval"]
{"$rows_left_out":98}
{"sheet":"CHECK","index":14,"n_rows":224,"n_cols":12,"rows_kept":224,"cut":false,"hidden":false,"merged":[[7,10,7,11]]}
[null,null,{"$f":"COVER!C5&\" | \"&COVER!C6&\" | \"&A3","v":"BOVAG | Kostprijsmodel \n(Gemotoriseerde) Tweewielers | CHECK"}]
[]
[{"$f":"MID(CELL(\"filename\",B3),FIND(\"]\",CELL(\"filename\",B3))+1,99)","v":"CHECK"}]
[null,null,"CHECK"]
[null,null,null,null,null,null,"CHECK",null,"Link naar input"]
[]
[null,null,"0.","Totale check"]
[null,null,null,null,null,null,null,null,null,null,"Alle checks OK?"]
[null,null,null,"0.1","Totale check",null,{"$f":"IF(H9>0,FALSE,TRUE)","v":false},{"$f":"SUM(H13:H97)","v":9},null,null,{"$f":"IF(H9>0,CHAR(108),\"\")","v":"l"},{"$f":"IF(H9=0,CHAR(108),\"\")","v":""}]
[]
[null,null,"1.","I_Generiek"]
[]
[null,null,null,"1.1","Heeft u een jaar ingevuld waarvoor u de kostprijs wilt berekenen?",null,{"$f":"IF(I_Generiek!F9=\"\",FALSE,TRUE)","v":false},{"$f":"IF(G13=FALSE,1,0)","v":1},{"$f":"IF(H13=1,\"KLIK HIER\",\"\")","v":"KLIK HIER"}]
[null,null,null,"1.2","Heeft u de extern en intern gefactureerde uren voor het betreffende jaar ingevuld?",null,{"$f":"IF(SUM(I_Generiek!F18,I_Generiek!F24)<=0,FALSE,TRUE)","v":false},{"$f":"IF(G14=FALSE,1,0)","v":1},"KLIK HIER"]
[]
[null,null,"2.","I_Verdeelsleutel"]
[]
[null,null,null,"2.1","Heeft u 1 of meerdere verdeelsleutels aangemaakt?",null,{"$f":"IF(SUMPRODUCT(I_Verdeelsleutel!J11:J18)*1=0,FALSE,TRUE)","v":false},{"$f":"IF(G18=FALSE,1,0)","v":1},{"$f":"IF(H18=1,\"KLIK HIER\",\"\")","v":"KLIK HIER"}]
[]
[null,null,"3.","I_Kosten"]
{"$rows_left_out":204}