{"text_format":"1","workbook":"xlsx","n_sheets":15,"sheets":["COVER","Input >>>","I_Generiek","I_Verdeelsleutel","I_Kosten","I_Omzet","I_Investeringen","I_Financiering","Calc >>>","C_Base","C_Scenario","Output >>>","O_Dashboard","O_Graph","CHECK"],"not_rendered":{"charts":12,"images":10,"macros":1,"external_links":0,"defined_names":7,"comments":0,"pivot_tables":0},"unopened":[],"bounds":{"document_bytes":16777216,"sheet_cells":100000,"rows_first":2000,"rows_last":500,"rows_between":2000,"halvings":0,"cell_chars":16384,"cell_head_chars":4096},"cells_cut":0,"cells_raw":0,"read":"whole","date_system":"1900"}

{"sheet":"COVER","index":0,"n_rows":12,"n_cols":3,"rows_kept":12,"cut":false,"hidden":false,"merged":[[12,2,12,4],[23,2,24,13],[5,2,5,4],[14,2,19,13]]}
[]
[]
[]
[]
[null,null,"BOVAG"]
[null,null,"Kostprijsmodel \nOnafhankelijke Autobedrijven (OAB)"]
[]
[]
[]
[]
[]
[null,null,"Finale versie"]

{"sheet":"Input >>>","index":1,"n_rows":22,"n_cols":3,"rows_kept":22,"cut":false,"hidden":false,"merged":[]}
[]
[]
[]
[]
[]
[]
[]
[]
[]
[]
[]
[]
[null,null,"Input >>>"]
[]
[]
[]
[]
[]
[]
[]
{"$rows_left_out":3}
{"sheet":"I_Generiek","index":2,"n_rows":209,"n_cols":6,"rows_kept":209,"cut":false,"hidden":false,"merged":[]}
[null,null,{"$f":"COVER!C5&\" | \"&COVER!C6&\" | \"&A3","v":"BOVAG | Kostprijsmodel \nOnafhankelijke Autobedrijven (OAB) | I_Generiek"}]
[]
[{"$f":"MID(CELL(\"filename\",B3),FIND(\"]\",CELL(\"filename\",B3))+1,99)","v":"I_Generiek"}]
[null,null,"Generiek"]
[]
[]
[null,null,"0.","Het (volledige) jaar waarvoor de gegevens ingevuld worden"]
[]
[null,null,null,null,"Jaar"]
[]
[]
[null,null,"1.",{"$f":"\"Gefactureerde uren \"&$F$9","v":"Gefactureerde uren "}]
[]
[null,null,null,"1.1",{"$f":"\"Gefactureerde uren \"&$F$9","v":"Gefactureerde uren "}]
[]
[null,null,null,null,"Eenheid",{"$f":"\"Gefactureerde uren \"&$F$9","v":"Gefactureerde uren "}]
[]
[null,null,null,null,"Gefactureerde uren"]
[]
[]
{"$rows_left_out":190}
{"sheet":"I_Verdeelsleutel","index":3,"n_rows":18,"n_cols":13,"rows_kept":18,"cut":false,"hidden":false,"merged":[]}
[null,null,{"$f":"COVER!C5&\" | \"&COVER!C6&\" | \"&A3","v":"BOVAG | Kostprijsmodel \nOnafhankelijke Autobedrijven (OAB) | I_Verdeelsleutel"}]
[]
[{"$f":"MID(CELL(\"filename\",B3),FIND(\"]\",CELL(\"filename\",B3))+1,99)","v":"I_Verdeelsleutel"}]
[null,null,"Verdeelsleutel"]
[]
[]
[null,null,"1.","Verdeelsleutel voor kosten"]
[]
[null,null,null,null,"Verdeelsleutel","Eenheid","Totaal","Behorende aan werkplaats","Behorende aan Sales","Behorende aan overige activiteiten","% werkplaats","Check"]
[]
[null,null,null,null,"Percentage",{"$f":"IF(E11=\"\",\"\",\"%\")","v":"%"},1,null,null,null,{"$f":"IFERROR($H11/$G11,\"\")","v":0},{"$f":"IF(AND(SUM(H11:J11)=G11,G11<>\"\",E11:G11<>\"\"),TRUE,FALSE)","v":false},{"$f":"IF(AND($G11<>SUM($H11:$J11),SUM($H11:$J11)<>0),\"Let op: Het Totaal komt niet overeen met de optelling van werkplaats, Sales en overige activiteiten\",\"\")","v":""}]
[null,null,null,null,"Omzet","EUR",null,null,null,null,{"$f":"IFERROR($H12/$G12,\"\")","v":""},{"$f":"IF(AND(SUM(H12:J12)=G12,G12<>\"\",E12:G12<>\"\"),TRUE,FALSE)","v":false},{"$f":"IF(AND($G12<>SUM($H12:$J12),SUM($H12:$J12)<>0),\"Let op: Het Totaal komt niet overeen met de optelling van werkplaats, Sales en overige activiteiten\",\"\")","v":""}]
[null,null,null,null,"Kosten","EUR",null,null,null,null,{"$f":"IFERROR($H13/$G13,\"\")","v":""},{"$f":"IF(AND(SUM(H13:J13)=G13,G13<>\"\",E13:G13<>\"\"),TRUE,FALSE)","v":false},""]
[null,null,null,null,"Aantal medewerkers","Aantal",null,null,null,null,"",{"$f":"IF(AND(SUM(H14:J14)=G14,G14<>\"\",E14:G14<>\"\"),TRUE,FALSE)","v":false},""]
[null,null,null,null,"Gebruiksoppervlak","m²",null,null,null,null,"",{"$f":"IF(AND(SUM(H15:J15)=G15,G15<>\"\",E15:G15<>\"\"),TRUE,FALSE)","v":false},""]
[null,null,null,null,null,null,null,null,null,null,"",{"$f":"IF(AND(SUM(H16:J16)=G16,G16<>\"\",E16:G16<>\"\"),TRUE,FALSE)","v":false},""]
[null,null,null,null,null,null,null,null,null,null,"",{"$f":"IF(AND(SUM(H17:J17)=G17,G17<>\"\",E17:G17<>\"\"),TRUE,FALSE)","v":false},""]
[null,null,null,null,null,null,null,null,null,null,"",{"$f":"IF(AND(SUM(H18:J18)=G18,G18<>\"\",E18:G18<>\"\"),TRUE,FALSE)","v":false},""]

{"sheet":"I_Kosten","index":4,"n_rows":92,"n_cols":13,"rows_kept":92,"cut":false,"hidden":false,"merged":[]}
[null,null,{"$f":"COVER!C5&\" | \"&COVER!C6&\" | \"&A3","v":"BOVAG | Kostprijsmodel \nOnafhankelijke Autobedrijven (OAB) | I_Kosten"}]
[]
[{"$f":"MID(CELL(\"filename\",B3),FIND(\"]\",CELL(\"filename\",B3))+1,99)","v":"I_Kosten"}]
[null,null,{"$f":"\"Kosten \"&I_Generiek!$F$9","v":"Kosten "}]
[null,null,null,null,null,null,"Keuze",null,"Eenheid",null,{"$f":"I_Generiek!$F$9","v":0},null,"Verdeelsleutel"]
[]
[null,null,"0.","Totale bedrijfskosten"]
[]
[null,null,null,"0.1","Totale bedrijfskosten (alle directe + indirecte kosten)"]
[]
[null,null,"1.","Personele lasten direct personeel"]
[]
[null,null,null,"1.1","Totale personeelskosten direct personeel (excl. opleidingskosten)",null,null,null,"EUR / jaar"]
[]
[null,null,null,"1.2","Opleidingskosten direct personeel",null,null,null,"EUR / jaar"]
[]
[null,null,"2.","Personele lasten indirect personeel"]
[]
[null,null,null,"2.1","Totale personeelskosten indirect personeel (excl. opleidingskosten)",null,null,null,"EUR / jaar"]
[]
{"$rows_left_out":73}
{"sheet":"I_Omzet","index":5,"n_rows":15,"n_cols":13,"rows_kept":15,"cut":false,"hidden":false,"merged":[]}
[null,null,{"$f":"COVER!C5&\" | \"&COVER!C6&\" | \"&A3","v":"BOVAG | Kostprijsmodel \nOnafhankelijke Autobedrijven (OAB) | I_Omzet"}]
[]
[{"$f":"MID(CELL(\"filename\",B3),FIND(\"]\",CELL(\"filename\",B3))+1,99)","v":"I_Omzet"}]
[null,null,{"$f":"\"Bruto omzet, korting leasemaatschappijen en materiaalkosten \" &I_Generiek!$F$9","v":"Bruto omzet, korting leasemaatschappijen en materiaalkosten "}]
[null,null,null,null,null,null,"Keuze",null,"Eenheid",null,{"$f":"I_Generiek!$F$9","v":0},null,"Verdeelsleutel"]
[]
[null,null,"1.","Bruto omzet, korting leasemaatschappijen en materiaalkosten"]
[]
[null,null,null,"1.1","Hebben de ingevulde kosten (op tabblad I_Kosten) enkel betrekking op de werkplaats?"]
[]
[null,null,null,"1.2",{"$f":"IF($G$9=\"Ja\",\"Bruto omzet - Werkplaats\",IF($G$9=\"Nee\",\"Bruto omzet - op bedrijfsniveau\",\"Bruto omzet\"))","v":"Bruto omzet"},null,null,null,"EUR / jaar"]
[]
[null,null,null,"1.3",{"$f":"IF($G$9=\"Ja\",\"Korting leasemaatschappijen - Werkplaats\",IF($G$9=\"Nee\",\"Korting leasemaatschappijen - op bedrijfsniveau\",\"Korting leasemaatschappijen\"))","v":"Korting leasemaatschappijen"},null,null,null,"EUR / jaar"]
[]
[null,null,null,"1.4",{"$f":"IF($G$9=\"Ja\",\"Materiaalkosten - Werkplaats\",IF($G$9=\"Nee\",\"Materiaalkosten - op bedrijfsniveau\",\"Materiaalkosten\"))","v":"Materiaalkosten"},null,null,null,"EUR / jaar"]

{"sheet":"I_Investeringen","index":6,"n_rows":72,"n_cols":15,"rows_kept":72,"cut":false,"hidden":false,"merged":[]}
[null,null,{"$f":"COVER!C5&\" | \"&COVER!C6&\" | \"&A3","v":"BOVAG | Kostprijsmodel \nOnafhankelijke Autobedrijven (OAB) | I_Investeringen"}]
[]
[{"$f":"MID(CELL(\"filename\",B3),FIND(\"]\",CELL(\"filename\",B3))+1,99)","v":"I_Investeringen"}]
[null,null,{"$f":"\"Extrainvesteringen \"&I_Generiek!$F$9","v":"Extrainvesteringen "}]
[null,null,null,null,null,null,"Keuze",null,"Eenheid",null,{"$f":"I_Generiek!$F$9","v":0},null,"Verdeelsleutel",null,"Directe / indirecte afschrijvingslasten"]
[]
[null,null,"1.","Extra investeringen"]
[]
[null,null,null,"1.1","Eenvoudige invoer voor extra investeringen?",null,null,null,null,null,{"$f":"IF(AND($G9<>\"\",OR(I_Kosten!$G$29=\"\",I_Kosten!$G$29=\"Nee\")),\"Let op: de keuze op tabblad I_Kosten geeft aan dat er geen extra investeringen meegenomen hoeven te worden\",\"\")","v":""}]
[null,null,null,null,"Nieuwe directe afschrijvingslasten (eenvoudige invoer)",null,null,null,"EUR / jaar",null,null,null,null,null,"Direct"]
[null,null,null,null,"Nieuwe indirecte afschrijvingslasten (eenvoudige invoer)",null,null,null,"EUR / jaar",null,null,null,null,null,"Indirect"]
[]
[null,null,null,"1.2","Extra investeringen (detail invoer)"]
[]
[null,null,null,null,"1.2.1","Investeringscategorieën"]
[]
[]
[]
[]
[]
{"$rows_left_out":53}
{"sheet":"I_Financiering","index":7,"n_rows":44,"n_cols":13,"rows_kept":44,"cut":false,"hidden":false,"merged":[]}
[null,null,{"$f":"COVER!C5&\" | \"&COVER!C6&\" | \"&A3","v":"BOVAG | Kostprijsmodel \nOnafhankelijke Autobedrijven (OAB) | I_Financiering"}]
[]
[{"$f":"MID(CELL(\"filename\",B3),FIND(\"]\",CELL(\"filename\",B3))+1,99)","v":"I_Financiering"}]
[null,null,{"$f":"\"Nieuwe rentelasten \"&I_Generiek!$F$9","v":"Nieuwe rentelasten "}]
[null,null,null,null,null,null,"Keuze",null,"Eenheid",null,{"$f":"I_Generiek!$F$9","v":0},null,"Verdeelsleutel"]
[]
[null,null,"1.","Nieuwe rentelasten"]
[]
[null,null,null,"1.1","Eenvoudige invoer voor nieuwe rentelasten?",null,null,null,null,null,{"$f":"IF(AND($G9<>\"\",OR(I_Kosten!$G$35=\"\",I_Kosten!$G$35=\"Nee\")),\"Let op: de keuze op tabblad I_Kosten geeft aan dat er geen nieuwe rentelasten meegenomen hoeven te worden\",\"\")","v":""}]
[null,null,null,null,"Nieuwe rentelasten (eenvoudige invoer)",null,null,null,"EUR / jaar"]
[]
[null,null,null,"1.2","Nieuwe rentelasten (detail invoer)"]
[]
[null,null,null,null,"1.2.1","Wilt u deze invoervelden activeren?"]
[null,null,null,null,null,"Financieringsbedrag",null,null,"EUR"]
[null,null,null,null,null,"Rentepercentage ",null,null,"% / jaar"]
[]
[null,null,null,null,"1.2.2","Wilt u deze invoervelden activeren?"]
[null,null,null,null,null,"Financieringsbedrag",null,null,"EUR"]
[null,null,null,null,null,"Rentepercentage",null,null,"% / jaar"]
{"$rows_left_out":25}
{"sheet":"Calc >>>","index":8,"n_rows":22,"n_cols":3,"rows_kept":22,"cut":false,"hidden":false,"merged":[]}
[]
[]
[]
[]
[]
[]
[]
[]
[]
[]
[]
[]
[null,null,"Calc >>>"]
[]
[]
[]
[]
[]
[]
[]
{"$rows_left_out":3}
{"sheet":"C_Base","index":9,"n_rows":301,"n_cols":17,"rows_kept":301,"cut":false,"hidden":false,"merged":[]}
[null,null,{"$f":"COVER!C5&\" | \"&COVER!C6&\" | \"&A3","v":"BOVAG | Kostprijsmodel \nOnafhankelijke Autobedrijven (OAB) | C_Base"}]
[]
[{"$f":"MID(CELL(\"filename\",B3),FIND(\"]\",CELL(\"filename\",B3))+1,99)","v":"C_Base"}]
[null,null,"Calculatie_Base"]
[null,null,null,null,null,null,null,null,null,null,"Input",null,"Verdeelsleutel",null,"% werkplaats",null,"Berekening werkplaats"]
[]
[null,null,"1.","Personeelskosten"]
[]
[null,null,null,"1.1",null,"Direct personeel"]
[]
[null,null,null,null,null,{"$f":"I_Kosten!E13","v":"Totale personeelskosten direct personeel (excl. opleidingskosten)"},null,null,"EUR / jaar",null,{"$f":"I_Kosten!K13","v":0},null,{"$f":"I_Kosten!M13","v":0},null,{"$f":"IFERROR(INDEX(I_Verdeelsleutel!$K$11:$K$18,MATCH($M11,I_Verdeelsleutel!$E$11:$E$18,0)),\"\")","v":""},null,{"$f":"IFERROR(INDEX(I_Verdeelsleutel!$K$11:$K$18,MATCH($M11,I_Verdeelsleutel!$E$11:$E$18,0))*$K11,0)","v":0}]
[null,null,null,null,null,{"$f":"I_Kosten!E15","v":"Opleidingskosten direct personeel"},null,null,"EUR / jaar",null,{"$f":"I_Kosten!K15","v":0},null,{"$f":"I_Kosten!M15","v":0},null,{"$f":"IFERROR(INDEX(I_Verdeelsleutel!$K$11:$K$18,MATCH($M12,I_Verdeelsleutel!$E$11:$E$18,0)),\"\")","v":""},null,{"$f":"IFERROR(INDEX(I_Verdeelsleutel!$K$11:$K$18,MATCH($M12,I_Verdeelsleutel!$E$11:$E$18,0))*$K12,0)","v":0}]
[]
[null,null,null,"1.2",null,"Indirect personeel"]
[]
[null,null,null,null,null,{"$f":"I_Kosten!E19","v":"Totale personeelskosten indirect personeel (excl. opleidingskosten)"},null,null,"EUR / jaar",null,{"$f":"I_Kosten!K19","v":0},null,{"$f":"I_Kosten!M19","v":0},null,{"$f":"IFERROR(INDEX(I_Verdeelsleutel!$K$11:$K$18,MATCH($M16,I_Verdeelsleutel!$E$11:$E$18,0)),\"\")","v":""},null,{"$f":"IFERROR(INDEX(I_Verdeelsleutel!$K$11:$K$18,MATCH($M16,I_Verdeelsleutel!$E$11:$E$18,0))*$K16,0)","v":0}]
[null,null,null,null,null,{"$f":"I_Kosten!E21","v":"Opleidingskosten indirect personeel"},null,null,"EUR / jaar",null,{"$f":"I_Kosten!K21","v":0},null,{"$f":"I_Kosten!M21","v":0},null,{"$f":"IFERROR(INDEX(I_Verdeelsleutel!$K$11:$K$18,MATCH($M17,I_Verdeelsleutel!$E$11:$E$18,0)),\"\")","v":""},null,{"$f":"IFERROR(INDEX(I_Verdeelsleutel!$K$11:$K$18,MATCH($M17,I_Verdeelsleutel!$E$11:$E$18,0))*$K17,0)","v":0}]
[]
[null,null,null,"1.3",null,"Totale personeelskosten"]
[]
{"$rows_left_out":282}
{"sheet":"C_Scenario","index":10,"n_rows":203,"n_cols":17,"rows_kept":203,"cut":false,"hidden":false,"merged":[]}
[null,null,{"$f":"COVER!C5&\" | \"&COVER!C6&\" | \"&A3","v":"BOVAG | Kostprijsmodel \nOnafhankelijke Autobedrijven (OAB) | C_Scenario"}]
[]
[{"$f":"MID(CELL(\"filename\",B3),FIND(\"]\",CELL(\"filename\",B3))+1,99)","v":"C_Scenario"}]
[null,null,"Calculatie_Scenario"]
[null,null,null,null,null,null,null,null,null,null,"Base werkplaats",null,"Gekozen draaiknop (%)",null,"Scenario werkplaats",null,"Scenario actief?"]
[]
[null,null,"1.","Personeelskosten"]
[]
[null,null,null,"1.1",null,"Direct personeel"]
[]
[null,null,null,null,null,{"$f":"I_Kosten!E13","v":"Totale personeelskosten direct personeel (excl. opleidingskosten)"},null,null,"EUR / jaar",null,{"$f":"C_Base!Q11","v":0},null,{"$f":"O_Dashboard!$P$11","v":0},null,{"$f":"IF(O_Dashboard!O13=TRUE,K11*(1+O_Dashboard!$P$11),K11)","v":0},null,{"$f":"IF(O_Dashboard!O13=TRUE,CHAR(252),CHAR(251))","v":"û"}]
[null,null,null,null,null,{"$f":"I_Kosten!E15","v":"Opleidingskosten direct personeel"},null,null,"EUR / jaar",null,{"$f":"C_Base!Q12","v":0},null,{"$f":"O_Dashboard!$P$19","v":0},null,{"$f":"IF(O_Dashboard!O19=TRUE,K12*(1+O_Dashboard!$P$19),K12)","v":0},null,{"$f":"IF(O_Dashboard!O19=TRUE,CHAR(252),CHAR(251))","v":"û"}]
[]
[null,null,null,"1.2",null,"Indirect personeel"]
[]
[null,null,null,null,null,{"$f":"I_Kosten!E19","v":"Totale personeelskosten indirect personeel (excl. opleidingskosten)"},null,null,"EUR / jaar",null,{"$f":"C_Base!Q16","v":0},null,{"$f":"O_Dashboard!$P$11","v":0},null,{"$f":"IF(O_Dashboard!O14=TRUE,K16*(1+O_Dashboard!$P$11),K16)","v":0},null,{"$f":"IF(O_Dashboard!O14=TRUE,CHAR(252),CHAR(251))","v":"û"}]
[null,null,null,null,null,{"$f":"I_Kosten!E21","v":"Opleidingskosten indirect personeel"},null,null,"EUR / jaar",null,{"$f":"C_Base!Q17","v":0},null,{"$f":"O_Dashboard!$P$20","v":0},null,{"$f":"IF(O_Dashboard!O20=TRUE,K17*(1+O_Dashboard!$P$20),K17)","v":0},null,{"$f":"IF(O_Dashboard!O20=TRUE,CHAR(252),CHAR(251))","v":"û"}]
[]
[null,null,null,"1.3",null,"Totale personeelskosten"]
[]
{"$rows_left_out":184}
{"sheet":"Output >>>","index":11,"n_rows":22,"n_cols":3,"rows_kept":22,"cut":false,"hidden":false,"merged":[]}
[]
[]
[]
[]
[]
[]
[]
[]
[]
[]
[]
[]
[null,null,"Output >>>"]
[]
[]
[]
[]
[]
[]
[]
{"$rows_left_out":3}
{"sheet":"O_Dashboard","index":12,"n_rows":116,"n_cols":39,"rows_kept":116,"cut":false,"hidden":false,"merged":[[115,23,115,24],[109,23,109,24],[110,23,110,24],[111,23,111,24],[112,23,112,24],[113,23,113,24],[104,23,104,24],[105,23,105,24],[106,23,106,24],[107,23,107,24],[108,23,108,24],[97,23,97,24],[98,23,98,24],[101,23,101,24],[102,23,102,24],[103,23,103,24],[92,23,92,24],[93,23,93,24],[94,23,94,24],[95,23,95,24],[96,23,96,24],[85,23,85,24],[88,23,88,24],[89,23,89,24],[90,23,90,24],[91,23,91,24],[80,23,80,24],[78,23,78,24],[81,23,81,24],[82,23,82,24],[84,23,84,24],[83,11,83,12],[74,11,74,12],[75,11,75,12],[78,11,78,12],[79,11,79,12],[82,11,82,12],[63,11,63,12],[66,11,66,12],[67,11,67,12],[70,11,70,12],[71,11,71,12],[54,11,54,12],[55,11,55,12],[58,11,58,12],[59,11,59,12],[62,11,62,12]]}
[null,null,{"$f":"COVER!C5&\" | \"&COVER!C6&\" | \"&A3","v":"BOVAG | Kostprijsmodel \nOnafhankelijke Autobedrijven (OAB) | O_Dashboard"}]
[]
[{"$f":"MID(CELL(\"filename\",B3),FIND(\"]\",CELL(\"filename\",B3))+1,99)","v":"O_Dashboard"}]
[null,null,"Dashboard",null,null,null,null,null,null,null,null,null,{"$f":"IF(CHECK!H9=0,\"Alles is juist ingevuld\",\"Er is iets niet juist ingevuld, controleer het tabblad CHECK om te zien wat er ontbreekt\")","v":"Er is iets niet juist ingevuld, controleer het tabblad CHECK om te zien wat er ontbreekt"}]
[]
[]
[null,null,"1.","Scenario analyse",null,null,null,null,null,null,null,null,null,null,null,null,null,null,"2.","Gemiddelde kostprijs werkplaats - INPUT",null,null,null,null,null,null,null,null,null,null,null,"4.","Verschil gemiddelde kostprijzen"]
[]
[null,null,null,"1.1","Kostenstijgingen / -dalingen",null,null,null,"% / jaar",null,null,null,"1.2","CAO-ontwikkeling",null,"% / jaar"]
[null,null,null,null,null,null,null,null,null,null,null,null,null,null,null,null,null,null,null,null,null,null,null,null,null,null,null,null,null,null,null,null,"Verschil kostprijzen",null,null,"Eenheid","INPUT","SCENARIO","Verschil"]
[null,null,null,"Directe overige kosten",null,null,null,null,null,null,null,null,null,"Loonstijging conform CAO",null,0]
[null,null,null,null,null,null,null,null,null,null,null,null,null,null,null,null,null,null,null,null,null,null,null,null,null,null,null,null,null,null,null,null,{"$f":"C_Scenario!F158","v":"Directe personeelskosten"},null,null,"EUR / uur",{"$f":"C_Scenario!K158","v":0},{"$f":"C_Scenario!O158","v":0},{"$f":"AL12-AK12","v":0}]
[null,null,null,{"$f":"C_Base!F278","v":"Kosten uitbesteed werk (specialist)"},null,null,null,1000,{"$f":"IF(D13=\"\",\"\",(H13-1000)/1000)","v":0},null,null,null,null,{"$f":"C_Base!F268","v":"Directe personeelskosten"},false,null,null,null,null,null,null,null,null,null,null,null,null,null,null,null,null,null,{"$f":"C_Scenario!F159","v":"Indirecte personeelskosten"},null,null,"EUR / uur",{"$f":"C_Scenario!K159","v":0},{"$f":"C_Scenario!O159","v":0},{"$f":"AL13-AK13","v":0}]
[null,null,null,{"$f":"C_Base!F279","v":"Garantiekosten"},null,null,null,1000,{"$f":"IF(D14=\"\",\"\",(H14-1000)/1000)","v":0},null,null,null,null,{"$f":"C_Base!F270","v":"Indirecte personeelskosten"},false,null,null,null,null,null,null,null,null,null,null,null,null,null,null,null,null,null,{"$f":"C_Scenario!F160","v":"Directe afschrijvingslasten"},null,null,"EUR / uur",{"$f":"C_Scenario!K160","v":0},{"$f":"C_Scenario!O160","v":0},0]
[null,null,null,{"$f":"C_Base!F280","v":"Kosten service-auto"},null,null,null,1000,0,null,null,null,null,null,null,null,null,null,null,null,null,null,null,null,null,null,null,null,null,null,null,null,{"$f":"C_Scenario!F161","v":"Indirecte afschrijvingslasten"},null,null,"EUR / uur",{"$f":"C_Scenario!K161","v":0},{"$f":"C_Scenario!O161","v":0},0]
[null,null,null,{"$f":"C_Base!F281","v":"Marketingkosten werkplaats"},null,null,null,1000,0,null,null,null,null,null,null,null,null,null,null,null,null,null,null,null,null,null,null,null,null,null,null,null,{"$f":"C_Scenario!F162","v":"Rentelasten"},null,null,"EUR / uur",{"$f":"C_Scenario!K162","v":0},{"$f":"C_Scenario!O162","v":0},0]
[null,null,null,{"$f":"C_Base!F282","v":"Equipment leasekosten"},null,null,null,1000,0,null,null,null,"1.3","Stijging opleidingskosten",null,"% / jaar",null,null,null,null,null,null,null,null,null,null,null,null,null,null,null,null,{"$f":"C_Scenario!F163","v":"Directe overige kosten"},null,null,"EUR / uur",{"$f":"C_Scenario!K163","v":0},{"$f":"C_Scenario!O163","v":0},0]
[null,null,null,{"$f":"C_Base!F283","v":""},null,null,null,1000,"",null,null,null,null,null,null,null,null,null,null,null,null,null,null,null,null,null,null,null,null,null,null,null,{"$f":"C_Scenario!F164","v":"Indirecte overige kosten"},null,null,"EUR / uur",{"$f":"C_Scenario!K164","v":0},{"$f":"C_Scenario!O164","v":0},0]
[null,null,null,{"$f":"C_Base!F284","v":""},null,null,null,1000,"",null,null,null,null,{"$f":"C_Base!F269","v":"Opleidingskosten direct personeel"},false,0,null,null,null,null,null,null,null,null,null,null,null,null,null,null,null,null,"Gemiddelde kostprijs per uur",null,null,"EUR / uur",{"$f":"SUM(AK12:AK18)","v":0},{"$f":"SUM(AL12:AL18)","v":0},0]
[null,null,null,{"$f":"C_Base!F285","v":""},null,null,null,1000,"",null,null,null,null,{"$f":"C_Base!F271","v":"Opleidingskosten indirect personeel"},false,0]
{"$rows_left_out":97}
{"sheet":"O_Graph","index":13,"n_rows":121,"n_cols":16,"rows_kept":121,"cut":false,"hidden":false,"merged":[[85,7,85,8],[86,7,86,8],[87,7,87,8],[83,7,83,8],[82,7,82,8],[84,7,84,8],[88,7,88,8],[101,7,101,8],[92,7,92,8],[93,7,93,8],[94,7,94,8],[95,7,95,8],[96,7,96,8],[97,7,97,8],[98,7,98,8],[99,7,99,8],[100,7,100,8],[89,7,89,8],[90,7,90,8],[91,7,91,8],[70,7,70,8],[71,7,71,8],[72,7,72,8],[73,7,73,8],[74,7,74,8],[75,7,75,8],[77,7,77,8],[79,7,79,8],[80,7,80,8],[81,7,81,8],[76,7,76,8],[78,7,78,8]]}
[null,null,{"$f":"COVER!C5&\" | \"&COVER!C6&\" | \"&A3","v":"BOVAG | Kostprijsmodel \nOnafhankelijke Autobedrijven (OAB) | O_Graph"}]
[]
[{"$f":"MID(CELL(\"filename\",B3),FIND(\"]\",CELL(\"filename\",B3))+1,99)","v":"O_Graph"}]
[null,null,"Calculaties voor dashboard"]
[]
[]
[null,null,"1.","Waterval 1 - INPUT"]
[]
[null,null,null,"1.1","Kostprijs werkplaats",null,null,"Kosten","Rank"]
[]
[null,null,null,null,{"$f":"C_Base!F256","v":"Directe personeelskosten"},null,null,{"$f":"C_Base!Q256","v":0},{"$f":"IF(H11=0,\"\",RANK(H11,IF($H$11:$H$17>0,$H$11:$H$17,0))+COUNTIF($H$11:$H11,$H11)-1)","v":""}]
[null,null,null,null,{"$f":"C_Base!F257","v":"Indirecte personeelskosten"},null,null,{"$f":"C_Base!Q257","v":0},{"$f":"IF(H12=0,\"\",RANK(H12,IF($H$11:$H$17>0,$H$11:$H$17,0))+COUNTIF($H$11:$H12,$H12)-1)","v":""}]
[null,null,null,null,{"$f":"C_Base!F258","v":"Directe afschrijvingslasten"},null,null,{"$f":"C_Base!Q258","v":0},{"$f":"IF(H13=0,\"\",RANK(H13,IF($H$11:$H$17>0,$H$11:$H$17,0))+COUNTIF($H$11:$H13,$H13)-1)","v":""}]
[null,null,null,null,{"$f":"C_Base!F259","v":"Indirecte afschrijvingslasten"},null,null,{"$f":"C_Base!Q259","v":0},{"$f":"IF(H14=0,\"\",RANK(H14,IF($H$11:$H$17>0,$H$11:$H$17,0))+COUNTIF($H$11:$H14,$H14)-1)","v":""}]
[null,null,null,null,{"$f":"C_Base!F260","v":"Rentelasten"},null,null,{"$f":"C_Base!Q260","v":0},{"$f":"IF(H15=0,\"\",RANK(H15,IF($H$11:$H$17>0,$H$11:$H$17,0))+COUNTIF($H$11:$H15,$H15)-1)","v":""}]
[null,null,null,null,{"$f":"C_Base!F261","v":"Directe overige kosten"},null,null,{"$f":"C_Base!Q261","v":0},{"$f":"IF(H16=0,\"\",RANK(H16,IF($H$11:$H$17>0,$H$11:$H$17,0))+COUNTIF($H$11:$H16,$H16)-1)","v":""}]
[null,null,null,null,{"$f":"C_Base!F262","v":"Indirecte overige kosten"},null,null,{"$f":"C_Base!Q262","v":0},{"$f":"IF(H17=0,\"\",RANK(H17,IF($H$11:$H$17>0,$H$11:$H$17,0))+COUNTIF($H$11:$H17,$H17)-1)","v":""}]
[null,null,null,null,"Totale kostprijs",null,null,{"$f":"SUM(H11:H17)","v":0}]
[]
[null,null,null,"1.2","Waterval"]
{"$rows_left_out":102}
{"sheet":"CHECK","index":14,"n_rows":214,"n_cols":12,"rows_kept":214,"cut":false,"hidden":false,"merged":[[7,10,7,11]]}
[null,null,{"$f":"COVER!C5&\" | \"&COVER!C6&\" | \"&A3","v":"BOVAG | Kostprijsmodel \nOnafhankelijke Autobedrijven (OAB) | CHECK"}]
[]
[{"$f":"MID(CELL(\"filename\",B3),FIND(\"]\",CELL(\"filename\",B3))+1,99)","v":"CHECK"}]
[null,null,"CHECK"]
[null,null,null,null,null,null,"CHECK",null,"Link naar input"]
[]
[null,null,"0.","Totale check"]
[null,null,null,null,null,null,null,null,null,null,"Alle checks OK?"]
[null,null,null,"0.1","Totale check",null,{"$f":"IF(H9>0,FALSE,TRUE)","v":false},{"$f":"SUM(H13:H87)","v":7},null,null,{"$f":"IF(H9>0,CHAR(108),\"\")","v":"l"},{"$f":"IF(H9=0,CHAR(108),\"\")","v":""}]
[]
[null,null,"1.","I_Generiek"]
[]
[null,null,null,"1.1","Heeft u een jaar ingevuld waarvoor u de kostprijs wilt berekenen?",null,{"$f":"IF(I_Generiek!F9=\"\",FALSE,TRUE)","v":false},{"$f":"IF(G13=FALSE,1,0)","v":1},{"$f":"IF(H13=1,\"KLIK HIER\",\"\")","v":"KLIK HIER"}]
[null,null,null,"1.2","Heeft u de gefactureerde uren voor het betreffende jaar ingevuld?",null,{"$f":"IF(I_Generiek!F18=\"\",FALSE,TRUE)","v":false},{"$f":"IF(G14=FALSE,1,0)","v":1},"KLIK HIER"]
[]
[null,null,"2.","I_Verdeelsleutel"]
[]
[null,null,null,"2.1","Heeft u 1 of meerdere verdeelsleutels aangemaakt?",null,{"$f":"IF(SUMPRODUCT(I_Verdeelsleutel!K11:K18)*1=0,FALSE,TRUE)","v":false},{"$f":"IF(G18=FALSE,1,0)","v":1},{"$f":"IF(H18=1,\"KLIK HIER\",\"\")","v":"KLIK HIER"}]
[]
[null,null,"3.","I_Kosten"]
{"$rows_left_out":194}