{"text_format":"1","workbook":"xlsx","n_sheets":17,"sheets":["COVER","Toelichting","Instructie","Input >>>","I_Contactinfo","I_Generiek","I_Verdeelsleutel","I_Kosten","I_Investeringen","I_Financiering","Calc >>>","C_Base","C_Scenario","Output >>>","O_Dashboard","O_Graph","CHECK"],"not_rendered":{"charts":7,"images":15,"macros":1,"external_links":0,"defined_names":6,"comments":0,"pivot_tables":0},"unopened":[],"bounds":{"document_bytes":16777216,"sheet_cells":100000,"rows_first":2000,"rows_last":500,"rows_between":2000,"halvings":0,"cell_chars":16384,"cell_head_chars":4096},"cells_cut":0,"cells_raw":0,"read":"whole","date_system":"1900"}

{"sheet":"COVER","index":0,"n_rows":12,"n_cols":3,"rows_kept":12,"cut":false,"hidden":false,"merged":[[12,2,12,4],[23,2,24,13],[5,2,5,4],[14,2,19,13]]}
[]
[]
[]
[]
[null,null,"BOVAG"]
[null,null,"Kostprijsmodel Aanhangwagenbedrijven"]
[]
[]
[]
[]
[]
[null,null,"Finale versie"]

{"sheet":"Toelichting","index":1,"n_rows":27,"n_cols":7,"rows_kept":27,"cut":false,"hidden":true,"merged":[]}
[null,null,{"$f":"COVER!C5&\" | \"&COVER!C6&\" | \"&A3","v":"BOVAG | Kostprijsmodel Aanhangwagenbedrijven | Toelichting"}]
[]
[{"$f":"MID(CELL(\"filename\",B3),FIND(\"]\",CELL(\"filename\",B3))+1,99)","v":"Toelichting"}]
[null,null,"Toelichting"]
[]
[]
[null,null,"1.","Toelichting van de verschillende celformats in dit inputtemplate"]
[]
[null,null,null,null,null,"Inputcellen, deze cellen dienen ingevuld te worden"]
[]
[null,null,null,null,null,"Inputcellen die o.b.v. de specifieke situatie niet ingevuld hoeven te worden (omdat de optie niet van toepassing is)"]
[]
[null,null,null,null,null,"Calculatiecellen, deze mogen niet gewijzigd worden"]
[]
[null,null,"2.","Toelichting gehanteerde terminologie"]
[]
[null,null,null,"Aftersales",null,null,"Aftersales omvat alle werkplaatsactiviteiten zoals (maar niet gelimiteerd tot) onderhoud, APK’s en bandenwissel"]
[null,null,null,"Direct personeel",null,null,"Direct personeel betreft het personeel dat werk uitvoert in de werkplaats (bv. monteurs)"]
[null,null,null,"Indirect personeel",null,null,"Indirect personeel betreft het personeel dat onder overhead valt (bv. Administratief-, HR en marketing medewerkers)"]
[null,null,null,"Nieuwe afschrijvingen",null,null,"Afschrijvingen die nog niet opgenomen zijn in de beschikbare data die u gebruikt om dit model te vullen, maar u wel wilt meenemen in de kostprijs berekening als gevolg van "]
{"$rows_left_out":8}
{"sheet":"Instructie","index":2,"n_rows":180,"n_cols":7,"rows_kept":180,"cut":false,"hidden":true,"merged":[]}
[null,null,{"$f":"COVER!C5&\" | \"&COVER!C6&\" | \"&A3","v":"BOVAG | Kostprijsmodel Aanhangwagenbedrijven | Instructie"}]
[]
[{"$f":"MID(CELL(\"filename\",B3),FIND(\"]\",CELL(\"filename\",B3))+1,99)","v":"Instructie"}]
[null,null,"Instructie"]
[]
[]
[null,null,"1.","Invullen van gegevens"]
[]
[null,null,null,"Allereerst dienen de gegevens die nodig zijn ingevuld te worden door de gebruiker. De verzameling van deze gegevens vindt plaats in 6 tabbladen en dienen qua volgorde zo doorlopen te worden zoals ze zijn"]
[null,null,null,"opgenomen in het inputtemplate."]
[]
[null,null,null,"I_Contactinfo"]
[null,null,null,"Op het eerste tabblad wordt algemene informatie over de gebruiker en het bedrijf gevraagd"]
[]
[]
[]
[]
[]
[]
[]
{"$rows_left_out":161}
{"sheet":"Input >>>","index":3,"n_rows":13,"n_cols":3,"rows_kept":13,"cut":false,"hidden":false,"merged":[]}
[]
[]
[]
[]
[]
[]
[]
[]
[]
[]
[]
[]
[null,null,"Input >>>"]

{"sheet":"I_Contactinfo","index":4,"n_rows":17,"n_cols":14,"rows_kept":17,"cut":false,"hidden":true,"merged":[]}
[null,null,{"$f":"COVER!C5&\" | \"&COVER!C6&\" | \"&A3","v":"BOVAG | Kostprijsmodel Aanhangwagenbedrijven | I_Contactinfo"}]
[]
[{"$f":"MID(CELL(\"filename\",B3),FIND(\"]\",CELL(\"filename\",B3))+1,99)","v":"I_Contactinfo"}]
[null,null,"Contactinformatie"]
[null,null,null,null,null,null,null,null,null,"Ingevuld:"]
[]
[null,null,"1.","Contactinformatie van uw organisatie",null,null,null,null,null,null,null,null,"1ste contactpersoon","2de contactpersoon (indien van toepassing)"]
[]
[null,null,null,"1.1 ","Naam organisatie",null,null,null,null,{"$f":"M9<>\"\"","v":false}]
[]
[null,null,null,"1.2","Naam contactpersoon",null,null,null,null,{"$f":"M11<>\"\"","v":false}]
[]
[null,null,null,"1.3","Functie contactpersoon",null,null,null,null,{"$f":"M13<>\"\"","v":false}]
[]
[null,null,null,"1.4","Telefoonnummer contactpersoon",null,null,null,null,{"$f":"M15<>\"\"","v":false}]
[]
[null,null,null,"1.5","E-mailadres contactpersoon",null,null,null,null,{"$f":"M17<>\"\"","v":false}]

{"sheet":"I_Generiek","index":5,"n_rows":205,"n_cols":6,"rows_kept":205,"cut":false,"hidden":false,"merged":[]}
[null,null,{"$f":"COVER!C5&\" | \"&COVER!C6&\" | \"&A3","v":"BOVAG | Kostprijsmodel Aanhangwagenbedrijven | I_Generiek"}]
[]
[{"$f":"MID(CELL(\"filename\",B3),FIND(\"]\",CELL(\"filename\",B3))+1,99)","v":"I_Generiek"}]
[null,null,"Generiek"]
[]
[]
[null,null,"0.","Het (volledige) jaar waarvoor de gegevens ingevuld worden"]
[]
[null,null,null,null,"Jaar"]
[]
[]
[null,null,"1.",{"$f":"\"Gefactureerde uren \"&$F$9","v":"Gefactureerde uren "}]
[]
[null,null,null,"1.1",{"$f":"\"Gefactureerde uren \"&$F$9","v":"Gefactureerde uren "}]
[]
[null,null,null,null,"Eenheid",{"$f":"\"Gefactureerde uren \"&$F$9","v":"Gefactureerde uren "}]
[]
[null,null,null,null,"Gefactureerde uren"]
[]
[]
{"$rows_left_out":186}
{"sheet":"I_Verdeelsleutel","index":6,"n_rows":21,"n_cols":12,"rows_kept":21,"cut":false,"hidden":false,"merged":[]}
[null,null,{"$f":"COVER!C5&\" | \"&COVER!C6&\" | \"&A3","v":"BOVAG | Kostprijsmodel Aanhangwagenbedrijven | I_Verdeelsleutel"}]
[]
[{"$f":"MID(CELL(\"filename\",B3),FIND(\"]\",CELL(\"filename\",B3))+1,99)","v":"I_Verdeelsleutel"}]
[null,null,"Verdeelsleutel"]
[]
[]
[null,null,"1.","Verdeelsleutel voor kosten"]
[]
[null,null,null,null,"Verdeelsleutel","Eenheid","Totaal","Behorende aan werkplaats","Behorende aan Sales","% werkplaats","Check"]
[]
[null,null,null,null,"Percentage",{"$f":"IF(E11=\"\",\"\",\"%\")","v":"%"},1,null,null,{"$f":"IFERROR($H11/SUM($H11:$I11),\"\")","v":""},{"$f":"IF(SUM(H11:I11)=G11,TRUE,FALSE)","v":false},{"$f":"IF(AND($G11<>SUM($H11:$I11),SUM($H11:$I11)<>0),\"Let op: Het Totaal komt niet overeen met de optelling van werkplaats en Sales\",\"\")","v":""}]
[null,null,null,null,"Omzet","EUR",null,null,null,{"$f":"IFERROR($H12/SUM($H12:$I12),\"\")","v":""},{"$f":"IF(SUM(H12:I12)=G12,TRUE,FALSE)","v":true},{"$f":"IF(AND($G12<>SUM($H12:$I12),SUM($H12:$I12)<>0),\"Let op: Het Totaal komt niet overeen met de optelling van werkplaats en Sales\",\"\")","v":""}]
[null,null,null,null,"Kosten","EUR",null,null,null,"",true,""]
[null,null,null,null,"Aantal medewerkers","Aantal",null,null,null,"",true,""]
[null,null,null,null,"Gebruiksoppervlak","m²",null,null,null,"",true,""]
[null,null,null,null,null,null,null,null,null,"",{"$f":"IF(AND(SUM(H16:I16)=G16,F16<>\"\"),TRUE,FALSE)","v":false},""]
[]
[]
[]
[null,null,null,null,null,null,null,null,null,"",{"$f":"IF(AND(SUM(H20:I20)=G20,F20<>\"\"),TRUE,FALSE)","v":false},""]
{"$rows_left_out":2}
{"sheet":"I_Kosten","index":7,"n_rows":114,"n_cols":13,"rows_kept":114,"cut":false,"hidden":false,"merged":[]}
[null,null,{"$f":"COVER!C5&\" | \"&COVER!C6&\" | \"&A3","v":"BOVAG | Kostprijsmodel Aanhangwagenbedrijven | I_Kosten"}]
[]
[{"$f":"MID(CELL(\"filename\",B3),FIND(\"]\",CELL(\"filename\",B3))+1,99)","v":"I_Kosten"}]
[null,null,{"$f":"\"Kosten \"&I_Generiek!$F$9","v":"Kosten "}]
[null,null,null,null,null,null,"Keuze",null,"Eenheid",null,{"$f":"I_Generiek!$F$9","v":0},null,"Verdeelsleutel"]
[]
[null,null,"0.","Totale bedrijfskosten"]
[]
[null,null,null,"0.1","Totale bedrijfskosten (alle directe + indirecte kosten)"]
[]
[null,null,"1.","Personele lasten direct personeel"]
[]
[null,null,null,"1.1","Personeelskosten afzonderlijk invullen voor personeel in loondienst en ingehuurd personeel?"]
[]
[null,null,null,"1.2","Totale personeelskosten direct personeel (excl. opleidingskosten)",null,null,null,"EUR / jaar"]
[]
[null,null,null,null,"1.2.1","Totale personeelskosten direct personeel (excl. opleidingskosten) - In loondienst",null,null,"EUR / jaar"]
[]
[null,null,null,null,"1.2.2","Totale personeelskosten direct personeel (excl. opleidingskosten) - Ingehuurd personeel",null,null,"EUR / jaar"]
[]
{"$rows_left_out":95}
{"sheet":"I_Investeringen","index":8,"n_rows":72,"n_cols":15,"rows_kept":72,"cut":false,"hidden":false,"merged":[]}
[null,null,{"$f":"COVER!C5&\" | \"&COVER!C6&\" | \"&A3","v":"BOVAG | Kostprijsmodel Aanhangwagenbedrijven | I_Investeringen"}]
[]
[{"$f":"MID(CELL(\"filename\",B3),FIND(\"]\",CELL(\"filename\",B3))+1,99)","v":"I_Investeringen"}]
[null,null,{"$f":"\"Extra investeringen \"&I_Generiek!$F$9","v":"Extra investeringen "}]
[null,null,null,null,null,null,"Keuze",null,"Eenheid",null,{"$f":"I_Generiek!$F$9","v":0},null,"Verdeelsleutel",null,"Directe / indirecte afschrijvingslasten"]
[]
[null,null,"1.","Extra investeringen"]
[]
[null,null,null,"1.1","Eenvoudige invoer voor extra investeringen?",null,null,null,null,null,{"$f":"IF(AND($G9<>\"\",OR(I_Kosten!$G$41=\"\",I_Kosten!$G$41=\"Nee\")),\"Let op: de keuze op tabblad I_Kosten geeft aan dat er geen extra investeringen meegenomen hoeven te worden\",\"\")","v":""}]
[null,null,null,null,"Nieuwe directe afschrijvingslasten (eenvoudige invoer)",null,null,null,"EUR / jaar",null,null,null,null,null,"Direct"]
[null,null,null,null,"Nieuwe indirecte afschrijvingslasten (eenvoudige invoer)",null,null,null,"EUR / jaar",null,null,null,null,null,"Indirect"]
[]
[null,null,null,"1.2","Extra investeringen (detail invoer)"]
[]
[null,null,null,null,"1.2.1","Investeringscategorieën"]
[]
[]
[]
[]
[]
{"$rows_left_out":53}
{"sheet":"I_Financiering","index":9,"n_rows":44,"n_cols":13,"rows_kept":44,"cut":false,"hidden":false,"merged":[]}
[null,null,{"$f":"COVER!C5&\" | \"&COVER!C6&\" | \"&A3","v":"BOVAG | Kostprijsmodel Aanhangwagenbedrijven | I_Financiering"}]
[]
[{"$f":"MID(CELL(\"filename\",B3),FIND(\"]\",CELL(\"filename\",B3))+1,99)","v":"I_Financiering"}]
[null,null,{"$f":"\"Nieuwe rentelasten \"&I_Generiek!$F$9","v":"Nieuwe rentelasten "}]
[null,null,null,null,null,null,"Keuze",null,"Eenheid",null,{"$f":"I_Generiek!$F$9","v":0},null,"Verdeelsleutel"]
[]
[null,null,"1.","Nieuwe rentelasten"]
[]
[null,null,null,"1.1","Eenvoudige invoer voor nieuwe rentelasten?",null,null,null,null,null,{"$f":"IF(AND($G9<>\"\",OR(I_Kosten!$G$47=\"\",I_Kosten!$G$47=\"Nee\")),\"Let op: de keuze op tabblad I_Kosten geeft aan dat er geen nieuwe rentelasten meegenomen hoeven te worden\",\"\")","v":""}]
[null,null,null,null,"Nieuwe rentelasten (eenvoudige invoer)",null,null,null,"EUR / jaar"]
[]
[null,null,null,"1.2","Nieuwe rentelasten (detail invoer)"]
[]
[null,null,null,null,"1.2.1","Wilt u deze invoervelden activeren?"]
[null,null,null,null,null,"Financieringsbedrag",null,null,"EUR"]
[null,null,null,null,null,"Rentepercentage ",null,null,"% / jaar"]
[]
[null,null,null,null,"1.2.2","Wilt u deze invoervelden activeren?"]
[null,null,null,null,null,"Financieringsbedrag",null,null,"EUR"]
[null,null,null,null,null,"Rentepercentage",null,null,"% / jaar"]
{"$rows_left_out":25}
{"sheet":"Calc >>>","index":10,"n_rows":13,"n_cols":3,"rows_kept":13,"cut":false,"hidden":false,"merged":[]}
[]
[]
[]
[]
[]
[]
[]
[]
[]
[]
[]
[]
[null,null,"Calc >>>"]

{"sheet":"C_Base","index":11,"n_rows":341,"n_cols":17,"rows_kept":341,"cut":false,"hidden":false,"merged":[]}
[null,null,{"$f":"COVER!C5&\" | \"&COVER!C6&\" | \"&A3","v":"BOVAG | Kostprijsmodel Aanhangwagenbedrijven | C_Base"}]
[]
[{"$f":"MID(CELL(\"filename\",B3),FIND(\"]\",CELL(\"filename\",B3))+1,99)","v":"C_Base"}]
[null,null,"Calculatie_Base"]
[null,null,null,null,null,null,null,null,null,null,"Input",null,"Verdeelsleutel",null,"% werkplaats",null,"Berekening werkplaats"]
[]
[null,null,"1.","Personeelskosten"]
[]
[null,null,null,"1.1",null,"Direct personeel - personeelskosten (excl. opleidingskosten) - Eenvoudige invoer",null,null,null,{"$f":"IF(J13=\"Ja\",\"Nee\",IF(J13=0,0,\"Ja\"))","v":0}]
[]
[null,null,null,null,null,{"$f":"I_Kosten!E15","v":"Totale personeelskosten direct personeel (excl. opleidingskosten)"},null,null,"EUR / jaar",null,{"$f":"IF($J$9=\"Ja\",I_Kosten!K15,0)","v":0},null,{"$f":"I_Kosten!M15","v":0},null,{"$f":"IFERROR(INDEX(I_Verdeelsleutel!$J$11:$J$21,MATCH($M11,I_Verdeelsleutel!$E$11:$E$21,0)),\"\")","v":""},null,{"$f":"IFERROR(INDEX(I_Verdeelsleutel!$J$11:$J$21,MATCH($M11,I_Verdeelsleutel!$E$11:$E$21,0))*$K11,0)","v":0}]
[]
[null,null,null,"1.2",null,"Direct personeel - personeelskosten (excl. opleidingskosten) - Detail invoer",null,null,null,{"$f":"I_Kosten!G13","v":0}]
[]
[null,null,null,null,null,{"$f":"I_Kosten!F17","v":"Totale personeelskosten direct personeel (excl. opleidingskosten) - In loondienst"},null,null,"EUR / jaar",null,{"$f":"IF($J$13=\"Ja\",I_Kosten!K17,0)","v":0},null,{"$f":"I_Kosten!M17","v":0},null,{"$f":"IFERROR(INDEX(I_Verdeelsleutel!$J$11:$J$21,MATCH($M15,I_Verdeelsleutel!$E$11:$E$21,0)),\"\")","v":""},null,{"$f":"IFERROR(INDEX(I_Verdeelsleutel!$J$11:$J$21,MATCH($M15,I_Verdeelsleutel!$E$11:$E$21,0))*$K15,0)","v":0}]
[null,null,null,null,null,{"$f":"I_Kosten!F19","v":"Totale personeelskosten direct personeel (excl. opleidingskosten) - Ingehuurd personeel"},null,null,"EUR / jaar",null,{"$f":"IF($J$13=\"Ja\",I_Kosten!K19,0)","v":0},null,{"$f":"I_Kosten!M19","v":0},null,{"$f":"IFERROR(INDEX(I_Verdeelsleutel!$J$11:$J$21,MATCH($M16,I_Verdeelsleutel!$E$11:$E$21,0)),\"\")","v":""},null,{"$f":"IFERROR(INDEX(I_Verdeelsleutel!$J$11:$J$21,MATCH($M16,I_Verdeelsleutel!$E$11:$E$21,0))*$K16,0)","v":0}]
[]
[null,null,null,"1.3",null,"Totale personeelskosten direct personeel (excl. opleidingskosten)"]
[]
[null,null,null,null,null,{"$f":"I_Kosten!E15","v":"Totale personeelskosten direct personeel (excl. opleidingskosten)"},null,null,"EUR / jaar",null,{"$f":"SUM(K11,K15:K16)","v":0},null,null,null,null,null,{"$f":"SUM(Q11,Q15:Q16)","v":0}]
{"$rows_left_out":322}
{"sheet":"C_Scenario","index":12,"n_rows":284,"n_cols":17,"rows_kept":284,"cut":false,"hidden":false,"merged":[]}
[null,null,{"$f":"COVER!C5&\" | \"&COVER!C6&\" | \"&A3","v":"BOVAG | Kostprijsmodel Aanhangwagenbedrijven | C_Scenario"}]
[]
[{"$f":"MID(CELL(\"filename\",B3),FIND(\"]\",CELL(\"filename\",B3))+1,99)","v":"C_Scenario"}]
[null,null,"Calculatie_Scenario"]
[null,null,null,null,null,null,null,null,null,null,"Base werkplaats",null,"Gekozen draaiknop (%)",null,"Scenario werkplaats",null,"Scenario actief?"]
[]
[null,null,"1.","Personeelskosten"]
[]
[]
[null,null,null,"1.1",null,"Direct personeel - personeelskosten (excl. opleidingskosten) - Eenvoudige invoer",null,null,null,{"$f":"IF(J24=\"Ja\",\"Nee\",IF(J24=0,0,\"Ja\"))","v":0}]
[]
[null,null,null,null,"1.1.1","Draaiknoppen van toepassing - Directe personeelskosten (excl. opleidingskosten)"]
[]
[null,null,null,null,null,{"$f":"O_Dashboard!$N$9","v":"CAO-ontwikkeling"},null,null,{"$f":"IF(O_Dashboard!$O$15=TRUE,O_Dashboard!$P$13,0)","v":0}]
[null,null,null,null,null,{"$f":"O_Dashboard!$N$23","v":"Krapte arbeidsmarkt"},null,null,{"$f":"IF(O_Dashboard!$O$27=TRUE,O_Dashboard!$P$27,0)","v":0}]
[null,null,null,null,null,{"$f":"O_Dashboard!$N$34","v":"Parttime werken"},null,null,{"$f":"IF(O_Dashboard!$O$38=TRUE,O_Dashboard!$P$38,0)","v":0}]
[]
[null,null,null,null,"1.1.2","Totale impact van de gekozen draaiknoppen",null,null,{"$f":"SUM(I14:I16)","v":0}]
[]
[null,null,null,null,"1.1.3","Totale personeelskosten direct personeel (excl. opleidingskosten)"]
{"$rows_left_out":265}
{"sheet":"Output >>>","index":13,"n_rows":13,"n_cols":3,"rows_kept":13,"cut":false,"hidden":false,"merged":[]}
[]
[]
[]
[]
[]
[]
[]
[]
[]
[]
[]
[]
[null,null,"Output >>>"]

{"sheet":"O_Dashboard","index":14,"n_rows":102,"n_cols":38,"rows_kept":102,"cut":false,"hidden":false,"merged":[[72,11,72,12],[73,11,73,12],[76,11,76,12],[77,11,77,12],[80,11,80,12],[81,11,81,12],[84,11,84,12],[85,11,85,12],[88,11,88,12],[89,11,89,12],[101,11,101,12],[92,11,92,12],[93,11,93,12],[96,11,96,12],[97,11,97,12],[100,11,100,12]]}
[null,null,{"$f":"COVER!C5&\" | \"&COVER!C6&\" | \"&A3","v":"BOVAG | Kostprijsmodel Aanhangwagenbedrijven | O_Dashboard"}]
[]
[{"$f":"MID(CELL(\"filename\",B3),FIND(\"]\",CELL(\"filename\",B3))+1,99)","v":"O_Dashboard"}]
[null,null,"Dashboard",null,null,null,null,null,null,null,null,null,{"$f":"IF(CHECK!H9=0,\"Alles is juist ingevuld\",\"Er is iets niet juist ingevuld, controleer het tabblad CHECK om te zien wat er ontbreekt\")","v":"Er is iets niet juist ingevuld, controleer het tabblad CHECK om te zien wat er ontbreekt"}]
[]
[]
[null,null,"1.","Scenario analyse",null,null,null,null,null,null,null,null,null,null,null,null,null,null,"2.","Kostprijs werkplaats - INPUT",null,null,null,null,null,null,null,null,null,null,"4.","Verschil kostprijzen"]
[]
[null,null,null,"1.1","Kostenstijgingen / -dalingen",null,null,null,"% / jaar",null,null,null,"1.2","CAO-ontwikkeling",null,"% / jaar"]
[null,null,null,null,null,null,null,null,null,null,null,null,null,null,null,null,null,null,null,null,null,null,null,null,null,null,null,null,null,null,null,"Verschil kostprijzen",null,null,"Eenheid","INPUT","SCENARIO","Verschil"]
[null,null,null,"Directe overige kosten",null,null,null,null,null,null,null,null,"U heeft gekozen voor EENVOUDIGE INVOER"]
[null,null,null,null,null,null,null,null,null,null,null,null,null,null,null,null,null,null,null,null,null,null,null,null,null,null,null,null,null,null,null,{"$f":"C_Scenario!F237","v":"Directe personeelskosten"},null,null,"EUR / uur",{"$f":"C_Scenario!K237","v":0},{"$f":"C_Scenario!O237","v":0},{"$f":"AK12-AJ12","v":0}]
[null,null,null,{"$f":"C_Base!F320","v":"Leasekosten werkplaatsapparatuur"},null,null,null,1000,{"$f":"IF(D13=\"\",\"\",(H13-1000)/1000)","v":0},null,null,null,null,"Loonstijging conform CAO",null,0,null,null,null,null,null,null,null,null,null,null,null,null,null,null,null,{"$f":"C_Scenario!F238","v":"Indirecte personeelskosten"},null,null,"EUR / uur",{"$f":"C_Scenario!K238","v":0},{"$f":"C_Scenario!O238","v":0},{"$f":"AK13-AJ13","v":0}]
[null,null,null,{"$f":"C_Base!F321","v":"Garantiekosten"},null,null,null,1000,0,null,null,null,null,null,null,null,null,null,null,null,null,null,null,null,null,null,null,null,null,null,null,{"$f":"C_Scenario!F239","v":"Directe afschrijvingslasten"},null,null,"EUR / uur",{"$f":"C_Scenario!K239","v":0},{"$f":"C_Scenario!O239","v":0},0]
[null,null,null,{"$f":"C_Base!F322","v":"Huisvestingskosten"},null,null,null,1000,0,null,null,null,null,{"$f":"IF(I_Kosten!$G$13=\"Ja\",\"N.v.t.\",C_Base!F306)","v":"Totale personeelskosten direct personeel (excl. opleidingskosten)"},false,null,null,null,null,null,null,null,null,null,null,null,null,null,null,null,null,{"$f":"C_Scenario!F240","v":"Indirecte afschrijvingslasten"},null,null,"EUR / uur",{"$f":"C_Scenario!K240","v":0},{"$f":"C_Scenario!O240","v":0},0]
[null,null,null,{"$f":"C_Base!F323","v":""},null,null,null,1000,"",null,null,null,null,{"$f":"IF(I_Kosten!$G$25=\"Ja\",\"N.v.t.\",C_Base!F310)","v":"Totale personeelskosten indirect personeel (excl. opleidingskosten)"},false,null,null,null,null,null,null,null,null,null,null,null,null,null,null,null,null,{"$f":"C_Scenario!F241","v":"Rentelasten"},null,null,"EUR / uur",{"$f":"C_Scenario!K241","v":0},{"$f":"C_Scenario!O241","v":0},0]
[null,null,null,{"$f":"C_Base!F324","v":""},null,null,null,1000,"",null,null,null,null,null,null,null,null,null,null,null,null,null,null,null,null,null,null,null,null,null,null,{"$f":"C_Scenario!F242","v":"Directe overige kosten"},null,null,"EUR / uur",{"$f":"C_Scenario!K242","v":0},{"$f":"C_Scenario!O242","v":0},0]
[null,null,null,{"$f":"C_Base!F325","v":""},null,null,null,1000,"",null,null,null,"U heeft gekozen voor DETAIL INVOER",null,null,null,null,null,null,null,null,null,null,null,null,null,null,null,null,null,null,{"$f":"C_Scenario!F243","v":"Indirecte overige kosten"},null,null,"EUR / uur",{"$f":"C_Scenario!K243","v":0},{"$f":"C_Scenario!O243","v":0},0]
[null,null,null,{"$f":"C_Base!F326","v":""},null,null,null,1000,"",null,null,null,null,null,null,null,null,null,null,null,null,null,null,null,null,null,null,null,null,null,null,"Kostprijs per uur",null,null,"EUR / uur",{"$f":"SUM(AJ12:AJ18)","v":0},{"$f":"SUM(AK12:AK18)","v":0},0]
[null,null,null,{"$f":"C_Base!F327","v":""},null,null,null,1000,"",null,null,null,null,{"$f":"IF(I_Kosten!$G$13=\"Nee\",\"N.v.t.\",\"Directe personeelskosten (excl. opleidingskosten) - in loondienst\")","v":"Directe personeelskosten (excl. opleidingskosten) - in loondienst"},false,0]
{"$rows_left_out":83}
{"sheet":"O_Graph","index":15,"n_rows":108,"n_cols":16,"rows_kept":108,"cut":false,"hidden":false,"merged":[]}
[null,null,{"$f":"COVER!C5&\" | \"&COVER!C6&\" | \"&A3","v":"BOVAG | Kostprijsmodel Aanhangwagenbedrijven | O_Graph"}]
[]
[{"$f":"MID(CELL(\"filename\",B3),FIND(\"]\",CELL(\"filename\",B3))+1,99)","v":"O_Graph"}]
[null,null,"Calculaties voor dashboard"]
[]
[]
[null,null,"1.","Waterval 1 - INPUT"]
[]
[null,null,null,"1.1","Kostprijs werkplaats",null,null,"Kosten","Rank"]
[]
[null,null,null,null,{"$f":"C_Base!F294","v":"Directe personeelskosten"},null,null,{"$f":"C_Base!Q294","v":0},{"$f":"IF(H11=0,\"\",RANK(H11,IF($H$11:$H$17>0,$H$11:$H$17,0))+COUNTIF($H$11:$H11,$H11)-1)","v":""}]
[null,null,null,null,{"$f":"C_Base!F295","v":"Indirecte personeelskosten"},null,null,{"$f":"C_Base!Q295","v":0},{"$f":"IF(H12=0,\"\",RANK(H12,IF($H$11:$H$17>0,$H$11:$H$17,0))+COUNTIF($H$11:$H12,$H12)-1)","v":""}]
[null,null,null,null,{"$f":"C_Base!F296","v":"Directe afschrijvingslasten"},null,null,{"$f":"C_Base!Q296","v":0},{"$f":"IF(H13=0,\"\",RANK(H13,IF($H$11:$H$17>0,$H$11:$H$17,0))+COUNTIF($H$11:$H13,$H13)-1)","v":""}]
[null,null,null,null,{"$f":"C_Base!F297","v":"Indirecte afschrijvingslasten"},null,null,{"$f":"C_Base!Q297","v":0},{"$f":"IF(H14=0,\"\",RANK(H14,IF($H$11:$H$17>0,$H$11:$H$17,0))+COUNTIF($H$11:$H14,$H14)-1)","v":""}]
[null,null,null,null,{"$f":"C_Base!F298","v":"Rentelasten"},null,null,{"$f":"C_Base!Q298","v":0},{"$f":"IF(H15=0,\"\",RANK(H15,IF($H$11:$H$17>0,$H$11:$H$17,0))+COUNTIF($H$11:$H15,$H15)-1)","v":""}]
[null,null,null,null,{"$f":"C_Base!F299","v":"Directe overige kosten"},null,null,{"$f":"C_Base!Q299","v":0},{"$f":"IF(H16=0,\"\",RANK(H16,IF($H$11:$H$17>0,$H$11:$H$17,0))+COUNTIF($H$11:$H16,$H16)-1)","v":""}]
[null,null,null,null,{"$f":"C_Base!F300","v":"Indirecte overige kosten"},null,null,{"$f":"C_Base!Q300","v":0},{"$f":"IF(H17=0,\"\",RANK(H17,IF($H$11:$H$17>0,$H$11:$H$17,0))+COUNTIF($H$11:$H17,$H17)-1)","v":""}]
[null,null,null,null,"Totale kostprijs",null,null,{"$f":"SUM(H11:H17)","v":0}]
[]
[null,null,null,"1.2","Waterval"]
{"$rows_left_out":89}
{"sheet":"CHECK","index":16,"n_rows":218,"n_cols":12,"rows_kept":218,"cut":false,"hidden":false,"merged":[[7,10,7,11]]}
[null,null,{"$f":"COVER!C5&\" | \"&COVER!C6&\" | \"&A3","v":"BOVAG | Kostprijsmodel Aanhangwagenbedrijven | CHECK"}]
[]
[{"$f":"MID(CELL(\"filename\",B3),FIND(\"]\",CELL(\"filename\",B3))+1,99)","v":"CHECK"}]
[null,null,"CHECK"]
[null,null,null,null,null,null,"CHECK",null,"Link naar input"]
[]
[null,null,"0.","Totale check"]
[null,null,null,null,null,null,null,null,null,null,"Alle checks OK?"]
[null,null,null,"0.1","Totale check",null,{"$f":"IF(H9>0,FALSE,TRUE)","v":false},{"$f":"SUM(H13:H91)","v":9},null,null,{"$f":"IF(H9>0,CHAR(108),\"\")","v":"l"},{"$f":"IF(H9=0,CHAR(108),\"\")","v":""}]
[]
[null,null,"1.","I_Generiek"]
[]
[null,null,null,"1.1","Heeft u een jaar ingevuld waarvoor u de kostprijs wilt berekenen?",null,{"$f":"IF(I_Generiek!F9=\"\",FALSE,TRUE)","v":false},{"$f":"IF(G13=FALSE,1,0)","v":1},{"$f":"IF(H13=1,\"KLIK HIER\",\"\")","v":"KLIK HIER"}]
[null,null,null,"1.2","Heeft u de gefactureerde uren voor het betreffende jaar ingevuld?",null,{"$f":"IF(I_Generiek!F18=\"\",FALSE,TRUE)","v":false},{"$f":"IF(G14=FALSE,1,0)","v":1},"KLIK HIER"]
[]
[null,null,"2.","I_Verdeelsleutel"]
[]
[null,null,null,"2.1","Heeft u 1 of meerdere verdeelsleutels aangemaakt?",null,{"$f":"IF(SUMPRODUCT(I_Verdeelsleutel!J11:J21)*1=0,FALSE,TRUE)","v":false},{"$f":"IF(G18=FALSE,1,0)","v":1},{"$f":"IF(H18=1,\"KLIK HIER\",\"\")","v":"KLIK HIER"}]
[]
[null,null,"3.","I_Kosten"]
{"$rows_left_out":198}